{"text_format":"1","workbook":"xlsx","n_sheets":5,"sheets":["NOMBRE","B","B17","Control","MACROS"],"not_rendered":{"charts":0,"images":1,"macros":1,"external_links":0,"defined_names":17,"comments":2,"pivot_tables":0},"unopened":[],"bounds":{"document_bytes":16777216,"sheet_cells":100000,"rows_first":2000,"rows_last":500,"rows_between":2000,"halvings":0,"cell_chars":16384,"cell_head_chars":4096},"cells_cut":0,"cells_raw":0,"read":"whole","date_system":"1900"}

{"sheet":"NOMBRE","index":0,"n_rows":36,"n_cols":32,"rows_kept":36,"cut":false,"hidden":false,"merged":[[1,8,1,13],[2,8,2,13],[13,0,13,1],[16,1,18,1],[0,0,0,1],[0,2,0,6],[8,0,8,1]]}
["DATOS DEL ESTABLECIMIENTO",null,"CÓDIGOS"]
["NOMBRE DE COMUNA",null,null,null,null,null,null,null,{"$f":"IF(OR(NOMBRE!C2=\"\",NOMBRE!D2=\"\",NOMBRE!E2=\"\",NOMBRE!F2=\"\",NOMBRE!G2=\"\"),\"Falta Cód. Com.\",\"\")","v":"Falta Cód. Com."},null,null,null,null,null,null,null,null,null,null,null,null,null,null,null,null,null,null,null,null,null,null,{"$f":"IF(I2>\"\",1,0)","v":1}]
["NOMBRE ESTABLECIMIENTO/ESTRATEGIA",null,null,null,null,null,null,null,{"$f":"IF(OR(NOMBRE!C3=\"\",NOMBRE!D3=\"\",NOMBRE!E3=\"\",NOMBRE!F3=\"\",NOMBRE!G3=\"\",NOMBRE!H3=\"\"),\"Falta Cód. Est.\",\"\")","v":"Falta Cód. Est."},null,null,null,null,null,null,null,null,null,null,null,null,null,null,null,null,null,null,null,null,null,null,{"$f":"IF(I3>\"\",1,0)","v":1}]
["TIPO DE ESTABLECIMIENTO/ESTRATEGIA",null,null,null,null,null,null,null,{"$f":"IF(OR(NOMBRE!B4=\"\"),\"Falta Tipo. Est.\",\"\")","v":"Falta Tipo. Est."},null,null,null,null,null,null,null,null,null,null,null,null,null,null,null,null,null,null,null,null,null,null,{"$f":"IF(I4>\"\",1,0)","v":1}]
["DEPENDENCIA",null,null,null,null,null,null,null,{"$f":"IF(OR(NOMBRE!B5=\"\"),\"Falta Dependencia. Est.\",\"\")","v":"Falta Dependencia. Est."},null,null,null,null,null,null,null,null,null,null,null,null,null,null,null,null,null,null,null,null,null,null,{"$f":"IF(I5>\"\",1,0)","v":1}]
["MES:",null,null,null,null,null,null,null,{"$f":"IF(OR(NOMBRE!C6=\"\",NOMBRE!D6=\"\"),\"Falta Cód. Mes.\",\"\")","v":"Falta Cód. Mes."},null,null,null,null,null,null,null,null,null,null,null,null,null,null,null,null,null,null,null,null,null,null,{"$f":"IF(I6>\"\",1,0)","v":1}]
["AÑO:",2017,null,null,null,null,null,null,null,null,null,null,null,null,null,null,null,null,null,null,null,null,null,null,null,null,null,null,null,null,null,{"$f":"SUM(AF2:AF6)","v":5}]
[]
["Versión 1.0: DICIEMBRE 2017"]
[]
["Director Servicio de Salud o Director Establecimiento",null,null,null,null,null,null,null,null,null,null,null,null,null,null,null,null,null,null,null,null,null,null,null,null,"ENERO","Establecimiento de Mayor Complejidad (EMAYC)","SERVICIO DE SALUD"]
["Jefe de Estadisticas",null,null,null,null,null,null,null,null,null,null,null,null,null,null,null,null,null,null,null,null,null,null,null,null,"FEBRERO","Establecimiento de Mediana Complejidad (EMEDC)","MUNICIPAL"]
[null,null,null,null,null,null,null,null,null,null,null,null,null,null,null,null,null,null,null,null,null,null,null,null,null,"MARZO","Establecimiento de Menor Complejidad (EMENC)","OTRA INSTITUCIÓN (Delegado)"]
["MINSAL - DEIS",null,null,null,null,null,null,null,null,null,null,null,null,null,null,null,null,null,null,null,null,null,null,null,null,"ABRIL","Centros de Diagnóstico Terapéutico (CDT)"]
[null,null,null,null,null,null,null,null,null,null,null,null,null,null,null,null,null,null,null,null,null,null,null,null,null,"MAYO","Centro de Referencia de Salud (CRS)"]
[null,null,null,null,null,null,null,null,null,null,null,null,null,null,null,null,null,null,null,null,null,null,null,null,null,"JUNIO","Consultorio General Urbano (CGU)"]
[null,"SERIE BS",null,null,null,null,null,null,null,null,null,null,null,null,null,null,null,null,null,null,null,null,null,null,null,"JULIO","Consultorio General Urbano (CGU) - CESFAM"]
[null,null,null,null,null,null,null,null,null,null,null,null,null,null,null,null,null,null,null,null,null,null,null,null,null,"AGOSTO","Consultorio General Urbano(CGU) con SAPU/SUR/SAR"]
[null,null,null,null,null,null,null,null,null,null,null,null,null,null,null,null,null,null,null,null,null,null,null,null,null,"SEPTIEMBRE","Consultorio General Urbano (CGU) - CESFAM con SAPU/SAR"]
[null,null,null,null,null,null,null,null,null,null,null,null,null,null,null,null,null,null,null,null,null,null,null,null,null,"OCTUBRE","Consultorio General Rural (CGR)"]
[null,null,null,null,null,null,null,null,null,null,null,null,null,null,null,null,null,null,null,null,null,null,null,null,null,"NOVIEMBRE","Consultorio General Rural (CGR) - CESFAM"]
[null,null,null,null,null,null,null,null,null,null,null,null,null,null,null,null,null,null,null,null,null,null,null,null,null,"DICIEMBRE","Consultorio General Rural (CGR) con SAPU/SUR/SAR"]
[null,null,null,null,null,null,null,null,null,null,null,null,null,null,null,null,null,null,null,null,null,null,null,null,null,null,"Consultorio General Rural (CGR) - CESFAM con SAPU/SUR/SAR"]
[null,null,null,null,null,null,null,null,null,null,null,null,null,null,null,null,null,null,null,null,null,null,null,null,null,null,"Posta de Salud Rural (PSR)"]
[null,null,null,null,null,null,null,null,null,null,null,null,null,null,null,null,null,null,null,null,null,null,null,null,null,null,"Centro Comunitario de Salud Familiar (CECOF)"]
[null,null,null,null,null,null,null,null,null,null,null,null,null,null,null,null,null,null,null,null,null,null,null,null,null,null,"Consultorio de Salud Mental (COSAM)"]
[null,null,null,null,null,null,null,null,null,null,null,null,null,null,null,null,null,null,null,null,null,null,null,null,null,null,"Programa de Reparación y Atención Integral de Salud (PRAIS)"]
[null,null,null,null,null,null,null,null,null,null,null,null,null,null,null,null,null,null,null,null,null,null,null,null,null,null,"Centro de Atención Funcionarios (CAF)"]
[null,null,null,null,null,null,null,null,null,null,null,null,null,null,null,null,null,null,null,null,null,null,null,null,null,null,"Clínica Dental Móvil (CDM)"]
[null,null,null,null,null,null,null,null,null,null,null,null,null,null,null,null,null,null,null,null,null,null,null,null,null,null,"Dirección Servicio de Salud (DSS)"]
[null,null,null,null,null,null,null,null,null,null,null,null,null,null,null,null,null,null,null,null,null,null,null,null,null,null,"Servicio de Atención Primaria de Urgencia (SAPU)"]
[null,null,null,null,null,null,null,null,null,null,null,null,null,null,null,null,null,null,null,null,null,null,null,null,null,null,"Servicio de Atención Primaria de Urgencia Alta Resolución (SAR)"]
[null,null,null,null,null,null,null,null,null,null,null,null,null,null,null,null,null,null,null,null,null,null,null,null,null,null,"Laboratorio Clínico o Dental"]
[null,null,null,null,null,null,null,null,null,null,null,null,null,null,null,null,null,null,null,null,null,null,null,null,null,null,"Servicio de Atención Primaria de Urgencia Dental (SAPUDENT)"]
[null,null,null,null,null,null,null,null,null,null,null,null,null,null,null,null,null,null,null,null,null,null,null,null,null,null,"Centro de Rehabilitación (CR)"]
[null,null,null,null,null,null,null,null,null,null,null,null,null,null,null,null,null,null,null,null,null,null,null,null,null,null,"Hospital de Campaña"]

{"sheet":"B","index":1,"n_rows":2943,"n_cols":38,"rows_kept":2943,"cut":false,"hidden":false,"merged":[[2521,2,2521,37],[1186,2,1186,37],[1266,2,1266,37],[1541,2,1541,37],[1331,2,1331,37],[1411,2,1411,37],[1874,2,1874,37],[2075,2,2075,37],[2113,2,2113,37],[1560,2,1560,37],[2268,2,2268,37],[2516,2,2516,37],[2233,2,2233,37],[2283,2,2283,37],[2302,2,2302,37],[2198,2,2198,37],[2227,2,2227,37],[1408,2,1408,37],[26,2,26,37],[1559,2,1559,37],[1472,2,1472,37],[769,2,769,37],[770,2,770,37],[541,2,541,37],[762,2,762,37],[1473,2,1473,37],[1003,2,1003,37],[1057,2,1057,37],[1129,2,1129,37],[209,29,209,37],[271,19,271,25],[271,29,271,37],[310,18,310,25],[310,29,310,37],[317,20,317,25],[317,29,317,37],[374,29,374,37],[410,29,410,37],[431,29,431,37],[450,2,450,25],[450,29,450,37],[703,2,703,37],[2787,2,2787,37],[2796,2,2796,37],[2816,2,2816,37],[2823,2,2823,37],[2533,2,2533,37],[2588,2,2588,37],[2591,2,2591,37],[2600,2,2600,37],[2610,2,2610,37],[2629,2,2629,37],[2666,2,2666,37],[2692,2,2692,37],[2743,2,2743,37],[2747,2,2747,37],[2742,10,2742,37],[2609,23,2609,37],[1,0,2,0],[2283,0,2283,1],[769,0,769,1],[770,0,770,1],[0,29,1,31],[0,35,2,35],[819,2,819,37],[827,2,827,37],[957,2,957,37],[980,2,980,37],[995,2,995,37],[1586,2,1586,37],[1695,2,1695,37],[1724,2,1724,37],[450,0,450,1],[832,2,832,37],[850,2,850,37],[929,2,929,37],[945,2,945,37],[0,37,2,37],[1938,2,1938,37],[2102,2,2102,37],[2103,2,2103,37],[0,17,1,19],[0,20,1,22],[0,3,0,6],[1,3,2,3],[0,36,2,36],[1,6,2,6],[1,8,1,10],[1,1,2,1],[2533,0,2533,1],[868,2,868,37],[0,33,1,34],[0,32,2,32],[1,4,1,5],[0,7,0,13],[1,7,2,7],[99,2,99,37],[127,2,127,37],[0,14,1,16],[0,2,2,2],[0,23,1,25],[3,2,3,36],[40,2,40,37],[63,2,63,37],[73,2,73,36],[0,26,1,28],[1,11,1,13],[1944,2,1944,37],[2036,2,2036,37],[1586,0,1586,1],[2075,0,2075,1],[1804,2,1804,37],[1939,2,1939,37],[800,29,800,37],[472,29,472,37],[511,29,511,37],[542,2,542,25],[542,29,542,37],[599,2,599,25],[599,29,599,37],[622,29,622,37],[787,2,787,25],[796,2,796,25],[796,29,796,37],[800,2,800,25],[58,2,58,37],[112,2,112,37],[460,2,460,37],[146,2,146,37],[209,20,209,25],[808,2,808,37],[816,2,816,37],[820,2,820,37],[828,2,828,37],[649,2,649,37],[776,29,776,37],[776,2,776,25],[780,2,780,25],[780,29,780,37],[787,29,787,37],[804,3,804,37],[771,2,771,25],[771,29,771,37]]}
[null,null,"TOTAL","ACTIVIDADES",null,null,null,"INTERVENCIONES QUIRÚRGICAS",null,null,null,null,null,null,"INTERVENCIONES QUIRÚRGICAS MAYORES NO AMBULATORIAS ELECTIVAS",null,null,"INTERVENCIONES QUIRÚRGICAS MAYORES AMBULATORIAS ELECTIVA",null,null,"INTERVENCIONES QUIRÚRGICAS MAYORES AMBULATORIAS URGENCIA",null,null,"INTERVENCIONES QUIRÚRGICAS MAYORES NO AMBULATORIAS URGENCIA",null,null,"PROCEDENCIA",null,null,"PRODUCCION INTRA HOSPITAL",null,null,"OPERATIVO","COMPRAS REALIZADAS",null,"VENTAS DE SERVICIOS","TRANSFERENCIA \n2018","TOTAL \nFACTURADO"]
["CODIGO","GLOSA",null,"TOTAL BENEFI-CIARIOS","BENEFICIARIOS",null,"NO BENEFI-CIARIOS","TOTAL BENEFICIARIOS","PRINCIPAL",null,null,"SECUNDARIA",null,null,null,null,null,"< 15 AÑOS",null,null,"< 15 AÑOS",null,null,"< 15 AÑOS"]
[null,null,null,null,"MAI","MLE",null,null,"MAI","MLE","NO BENEFI-CIARIO","MAI","MLE","NO BENEFI-CIARIO","TOTAL","< 15 AÑOS","15 AÑOS Y MÁS","TOTAL","< 15 AÑOS","15 AÑOS Y MÁS","TOTAL","< 15 AÑOS","15 AÑOS Y MÁS","TOTAL","< 15 AÑOS","15 AÑOS Y MÁS","ATENCION CERRADA","ATENCION ABIERTA","EMERGENCIA","POR \nHONO-\nRARIOS","POR CONVENIOS","POR\nCONSULTO-\nRES DE \nLLAMADA",null,"AL SISTEMA ","EXTRA-SISTEMA"]
[null,"CONSULTAS Y ATENCION MEDICA "]
["0101101","Consulta o control médico integral en atención primaria",{"$f":"SUM(D5+G5)","v":6},{"$f":"SUM(E5:F5)","v":4},2,2,2,null,null,null,null,null,null,null,null,null,null,null,null,null,null,null,null,null,null,null,null,null,null,null,null,null,null,null,null,null,4590,{"$f":"AK5*E5","v":9180}]
["0101102","Consulta o control médico integral en especialidades (Hosp. Mediana Complejidad)",{"$f":"SUM(D6+G6)","v":6},{"$f":"SUM(E6:F6)","v":4},2,2,2,null,null,null,null,null,null,null,null,null,null,null,null,null,null,null,null,null,null,null,null,null,null,null,null,null,null,null,null,null,5780,11560]
["0101103","Consulta médica integral en servicio de urgencia (Hosp. Alta Complejidad)",6,4,2,2,2,null,null,null,null,null,null,null,null,null,null,null,null,null,null,null,null,null,null,null,null,null,null,null,null,null,null,null,null,null,12390,24780]
["0101104","Consulta médica integral en C.R.S.",6,4,2,2,2,null,null,null,null,null,null,null,null,null,null,null,null,null,null,null,null,null,null,null,null,null,null,null,null,null,null,null,null,null,7400,14800]
["0101105","Consulta médica integral en servicio de urgencia (Hosp. Mediana Complejidad)",6,4,2,2,2,null,null,null,null,null,null,null,null,null,null,null,null,null,null,null,null,null,null,null,null,null,null,null,null,null,null,null,null,null,8120,16240]
["0101106","Asistencia de cardiólogo a cirugías no cardíacas",6,4,2,2,2,null,null,null,null,null,null,null,null,null,null,null,null,null,null,null,null,null,null,null,null,null,null,null,null,null,null,null,null,null,15530,31060]
["0101107","Atención médica del recién nacido",6,4,2,2,2,null,null,null,null,null,null,null,null,null,null,null,null,null,null,null,null,null,null,null,null,null,null,null,null,null,null,null,null,null,15530,31060]
["0101108","Consulta integral de especialidades en Cirugía, Ginecología y Obstetricia, Ortopedia y Traumatología (en CDT)",6,4,2,2,2,null,null,null,null,null,null,null,null,null,null,null,null,null,null,null,null,null,null,null,null,null,null,null,null,null,null,null,null,null,6260,12520]
["0101109","Consulta integral de especialidades en Urología, Otorrinolaringología, Medicina Fisica y Rehabilitación, Dermatología, Pediatría y Subespecialidades (en CDT)",6,4,2,2,2,null,null,null,null,null,null,null,null,null,null,null,null,null,null,null,null,null,null,null,null,null,null,null,null,null,null,null,null,null,7510,15020]
["0101110","Consulta integral de especialidades en Medicina Interna y Subespecialidades, Oftalmología, Neurología, Oncología (en CDT)",6,4,2,2,2,null,null,null,null,null,null,null,null,null,null,null,null,null,null,null,null,null,null,null,null,null,null,null,null,null,null,null,null,null,9310,18620]
["0101111","Consulta integral de especialidades en Cirugía, Ginecología y Obstetricia, Ortopedia y Traumatología (Hosp. Alta Complejidad)",6,4,2,2,2,null,null,null,null,null,null,null,null,null,null,null,null,null,null,null,null,null,null,null,null,null,null,null,null,null,null,null,null,null,6260,12520]
["0101112","Consulta integral de especialidades en Urología, Otorrinolaringología, Medicina Física y Rehabilitación, Dermatología, Pediatría y Subespecialidades (Hosp. Alta Complejidad)",6,4,2,2,2,null,null,null,null,null,null,null,null,null,null,null,null,null,null,null,null,null,null,null,null,null,null,null,null,null,null,null,null,null,7510,15020]
["0101113","Consulta integral de especialidades en Medicina Interna y Subespecialidades, Oftalmología, Neurología, Oncología (Hosp. Alta Complejidad)",6,4,2,2,2,null,null,null,null,null,null,null,null,null,null,null,null,null,null,null,null,null,null,null,null,null,null,null,null,null,null,null,null,null,9310,18620]
[null,"TOTAL ARANCEL MAI",{"$f":"SUM(C5:C17)","v":78},{"$f":"SUM(D5:D17)","v":52},26,26,26,null,null,null,null,null,null,null,null,null,null,null,null,null,null,null,null,null,null,null,0,0,0,0,0,0,0,0,0,0,115500,231000]
["0101001","Consulta médica general",{"$f":"SUM(D19+G19)","v":0},{"$f":"SUM(E19:F19)","v":0}]
[null,"Consultas de urgencia en Hospitales de baja complejidad",0,0]
[null,"Consultas de especialidad en hospitales de baja complejidad y establecimientos de APS",0,0]
[null,"Otras consulta médica de especialidades ",0,0]
[null,"Consulta médica de especialidad en servicio de urgencia",0,0]
["0101308","Consulta Médica de Especialidad en Obstetricia y Ginecología",0,0]
[null,"TOTAL ARANCEL MLE Y NO ARANCELADO",{"$f":"SUM(C19:C24)","v":0},{"$f":"SUM(D19:D24)","v":0},{"$f":"SUM(E19:E24)","v":0},{"$f":"SUM(F19:F24)","v":0},{"$f":"SUM(G19:G24)","v":0},null,null,null,null,null,null,null,null,null,null,null,null,null,null,null,null,null,null,null,{"$f":"SUM(AA19:AA24)","v":0},{"$f":"SUM(AB19:AB24)","v":0},0,0,0,0,0,0,0,0]
[null,"TOTAL PRODUCCION",{"$f":"SUM(C18,C25)","v":78},{"$f":"SUM(D18,D25)","v":52},{"$f":"SUM(E18,E25)","v":26},{"$f":"SUM(F18,F25)","v":26},{"$f":"SUM(G18,G25)","v":26},null,null,null,null,null,null,null,null,null,null,null,null,null,null,null,null,null,null,null,{"$f":"SUM(AA18,AA25)","v":0},0,0,0,0,0,0,0,0,0,{"$f":"SUM(AK18,AK25)","v":115500},231000]
[null,"CONSULTAS POR OTROS PROFESIONALES DE LA SALUD                                       "]
["0102001","Consulta o control por enfermera, matrona o nutricionista",0,0,null,null,null,null,null,null,null,null,null,null,null,null,null,null,null,null,null,null,null,null,null,null,null,null,null,null,null,null,null,null,null,null,1220,{"$f":"AK28*E28","v":0}]
["0102002","Control de salud niño con EDP por enfermera",0,0,null,null,null,null,null,null,null,null,null,null,null,null,null,null,null,null,null,null,null,null,null,null,null,null,null,null,null,null,null,null,null,null,2090,0]
["0102003","Consulta o control por auxiliar de enfermería",0,0,null,null,null,null,null,null,null,null,null,null,null,null,null,null,null,null,null,null,null,null,null,null,null,null,null,null,null,null,null,null,null,null,670,0]
["0102005","Consulta por fonoaudiólogo",0,0,null,null,null,null,null,null,null,null,null,null,null,null,null,null,null,null,null,null,null,null,null,null,null,null,null,null,null,null,null,null,null,null,1660,0]
["0102006","Atención kinesiológica integral ambulatoria",0,0,null,null,null,null,null,null,null,null,null,null,null,null,null,null,null,null,null,null,null,null,null,null,null,null,null,null,null,null,null,null,null,null,1340,0]
["0102007","Atención integral por terapeuta ocupacional",0,0,null,null,null,null,null,null,null,null,null,null,null,null,null,null,null,null,null,null,null,null,null,null,null,null,null,null,null,null,null,null,null,null,1220,0]
[null,"TOTAL ARANCEL MAI",{"$f":"SUM(C28:C33)","v":0},{"$f":"SUM(D28:D33)","v":0},{"$f":"SUM(E28:E33)","v":0},{"$f":"SUM(F28:F33)","v":0},{"$f":"SUM(G28:G33)","v":0},null,null,null,null,null,null,null,null,null,null,null,null,null,null,null,null,null,null,null,{"$f":"SUM(AA28:AA33)","v":0},0,0,0,0,0,0,0,0,0,{"$f":"SUM(AK28:AK33)","v":8200},{"$f":"SUM(AL28:AL33)","v":0}]
[null,"Consulta por otros profesionales ",0,0]
[null,"Consultas/ Controles de Especialidades Odontológica",0,0]
[null,"Consultas de morbilidad odontológica",0,0]
[null,"Consultas de urgencia odontológica",0,0]
[null,"TOTAL ARANCEL MLE Y NO ARANCELADO",{"$f":"SUM(C35:C38)","v":0},{"$f":"SUM(D35:D38)","v":0},{"$f":"SUM(E35:E38)","v":0},{"$f":"SUM(F35:F38)","v":0},{"$f":"SUM(G35:G38)","v":0},null,null,null,null,null,null,null,null,null,null,null,null,null,null,null,null,null,null,null,{"$f":"SUM(AA35:AA38)","v":0},0,0,0,0,0,0,0,0,0]
[null,"TOTAL PRODUCCION",{"$f":"SUM(C34+C39)","v":0},{"$f":"SUM(D34+D39)","v":0},{"$f":"SUM(E34+E39)","v":0},{"$f":"SUM(F34+F39)","v":0},{"$f":"SUM(G34+G39)","v":0},null,null,null,null,null,null,null,null,null,null,null,null,null,null,null,null,null,null,null,{"$f":"SUM(AA34+AA39)","v":0},0,0,0,0,0,0,0,0,0,{"$f":"SUM(AK34+AK39)","v":8200},{"$f":"SUM(AL34+AL39)","v":0}]
[null,"EDUCACION DE GRUPO                                                                                         "]
["0103001","Educación de grupo por médico",0,0,null,null,null,null,null,null,null,null,null,null,null,null,null,null,null,null,null,null,null,null,null,null,null,null,null,null,null,null,null,null,null,null,4010,{"$f":"AK42*E42","v":0}]
["0103002","Educación de grupo por enfermera, matrona o nutricionista",0,0,null,null,null,null,null,null,null,null,null,null,null,null,null,null,null,null,null,null,null,null,null,null,null,null,null,null,null,null,null,null,null,null,2200,{"$f":"AK43*E43","v":0}]
["0103003","Educación de grupo por asistente social",0,0,null,null,null,null,null,null,null,null,null,null,null,null,null,null,null,null,null,null,null,null,null,null,null,null,null,null,null,null,null,null,null,null,2200,{"$f":"AK44*E44","v":0}]
["0103004","Educación de grupo por auxiliar de enfermería",0,0,null,null,null,null,null,null,null,null,null,null,null,null,null,null,null,null,null,null,null,null,null,null,null,null,null,null,null,null,null,null,null,null,670,{"$f":"AK45*E45","v":0}]
[null,"TOTAL ARANCEL MAI",{"$f":"SUM(C42:C45)","v":0},{"$f":"SUM(D42:D45)","v":0},{"$f":"SUM(E42:E45)","v":0},{"$f":"SUM(F42:F45)","v":0},{"$f":"SUM(G42:G45)","v":0},null,null,null,null,null,null,null,null,null,null,null,null,null,null,null,null,null,null,null,{"$f":"SUM(AA42:AA45)","v":0},0,0,0,0,0,0,0,0,0,{"$f":"SUM(AK42:AK45)","v":9080},{"$f":"SUM(AL42:AL45)","v":0}]
[null,"Educación de grupo por otro integrante del equipo de salud",0,0]
[null,"TOTAL ARANCEL MLE Y NO ARANCELADO",{"$f":"C47","v":0},{"$f":"D47","v":0},{"$f":"E47","v":0},{"$f":"F47","v":0},{"$f":"G47","v":0},null,null,null,null,null,null,null,null,null,null,null,null,null,null,null,null,null,null,null,{"$f":"AA47","v":0},0,0,0,0,0,0,0,0,0]
[null,"TOTAL PRODUCCION",{"$f":"SUM(C46+C48)","v":0},{"$f":"SUM(D46+D48)","v":0},{"$f":"SUM(E46+E48)","v":0},{"$f":"SUM(F46+F48)","v":0},{"$f":"SUM(G46+G48)","v":0},null,null,null,null,null,null,null,null,null,null,null,null,null,null,null,null,null,null,null,{"$f":"SUM(AA46+AA48)","v":0},0,0,0,0,0,0,0,0,0,{"$f":"SUM(AK46+AK48)","v":9080},{"$f":"SUM(AL46+AL48)","v":0}]
[null,"VISITAS DOMICILIARIAS                                                                                       "]
["0104001","Visita a domicilio por enfermera, matrona o nutricionista",0,0,null,null,null,null,null,null,null,null,null,null,null,null,null,null,null,null,null,null,null,null,null,null,null,null,null,null,null,null,null,null,null,null,1910,{"$f":"AK51*E51","v":0}]
["0104002","Visita a domicilio por asistente social",0,0,null,null,null,null,null,null,null,null,null,null,null,null,null,null,null,null,null,null,null,null,null,null,null,null,null,null,null,null,null,null,null,null,1910,{"$f":"AK52*E52","v":0}]
["0104003","Visita a domicilio por auxiliar de enfermería",0,0,null,null,null,null,null,null,null,null,null,null,null,null,null,null,null,null,null,null,null,null,null,null,null,null,null,null,null,null,null,null,null,null,1100,{"$f":"AK53*E53","v":0}]
[null,"TOTAL ARANCEL MAI",{"$f":"SUM(C51:C53)","v":0},{"$f":"SUM(D51:D53)","v":0},{"$f":"SUM(E51:E53)","v":0},{"$f":"SUM(F51:F53)","v":0},{"$f":"SUM(G51:G53)","v":0},null,null,null,null,null,null,null,null,null,null,null,null,null,null,null,null,null,null,null,{"$f":"SUM(AA51:AA53)","v":0},0,0,{"$f":"SUM(AD51:AD53)","v":0},0,0,0,0,0,0,{"$f":"SUM(AK51:AK53)","v":4920},{"$f":"SUM(AL51:AL53)","v":0}]
[null,"Visita a domicilio por otro integrante del equipo de salud",0,0]
[null,"Visita domiciaria por otro profesional y técnicos paramédico",0,0]
[null,"TOTAL ARANCEL MLE Y NO ARANCELADO",{"$f":"SUM(C55:C56)","v":0},{"$f":"SUM(D55:D56)","v":0},{"$f":"SUM(E55:E56)","v":0},{"$f":"SUM(F55:F56)","v":0},{"$f":"SUM(G55:G56)","v":0},null,null,null,null,null,null,null,null,null,null,null,null,null,null,null,null,null,null,null,{"$f":"SUM(AA55:AA56)","v":0},0,0,0,0,0,0,0,0,0]
[null,"TOTAL PRODUCCION",{"$f":"SUM(C54+C57)","v":0},{"$f":"SUM(D54+D57)","v":0},{"$f":"SUM(E54+E57)","v":0},{"$f":"SUM(F54+F57)","v":0},{"$f":"SUM(G54+G57)","v":0},null,null,null,null,null,null,null,null,null,null,null,null,null,null,null,null,null,null,null,{"$f":"SUM(AA54+AA57)","v":0},0,0,0,0,0,0,0,0,0,{"$f":"SUM(AK54+AK57)","v":4920},{"$f":"SUM(AL54+AL57)","v":0}]
[null,"VACUNACION Y DESPARASITACION                                                                      "]
["0105001","Vacunaciones (sólo considera administración)",0,0,null,null,null,null,null,null,null,null,null,null,null,null,null,null,null,null,null,null,null,null,null,null,null,null,null,null,null,null,null,null,null,null,830,{"$f":"AK60*E60","v":0}]
["0105002","Desparasitación sarna (cada persona)",0,0,null,null,null,null,null,null,null,null,null,null,null,null,null,null,null,null,null,null,null,null,null,null,null,null,null,null,null,null,null,null,null,null,100,{"$f":"AK61*E61","v":0}]
["0105003","Desparasitación pediculosis (cada persona)",0,0,null,null,null,null,null,null,null,null,null,null,null,null,null,null,null,null,null,null,null,null,null,null,null,null,null,null,null,null,null,null,null,null,100,{"$f":"AK62*E62","v":0}]
[null,"TOTAL",{"$f":"SUM(C60:C62)","v":0},{"$f":"SUM(D60:D62)","v":0},{"$f":"SUM(E60:E62)","v":0},{"$f":"SUM(F60:F62)","v":0},{"$f":"SUM(G60:G62)","v":0},null,null,null,null,null,null,null,null,null,null,null,null,null,null,null,null,null,null,null,{"$f":"SUM(AA60:AA62)","v":0},0,0,0,0,0,0,0,0,0,{"$f":"SUM(AK60:AK62)","v":1030},{"$f":"SUM(AL60:AL62)","v":0}]
[null,"MISCELANEOS                                                                                            "]
["0106002","Curación simple ambulatoria",0,0,null,null,null,null,null,null,null,null,null,null,null,null,null,null,null,null,null,null,null,null,null,null,null,null,null,null,null,null,null,null,null,null,730,{"$f":"AK65*E65","v":0}]
["0106005","Autocontrol pacientes Diabetico insulino dependiente (D.I.D. mensual)",0,0,null,null,null,null,null,null,null,null,null,null,null,null,null,null,null,null,null,null,null,null,null,null,null,null,null,null,null,null,null,null,null,null,16550,{"$f":"AK66*E66","v":0}]
["0106006","Oxigenoterapia domiciliaria (pacientes oxígeno dependientes)",0,0,null,null,null,null,null,null,null,null,null,null,null,null,null,null,null,null,null,null,null,null,null,null,null,null,null,null,null,null,null,null,null,null,38010,{"$f":"AK67*E67","v":0}]
["0106004","Despacho de recetas a crónicos",0,0,null,null,null,null,null,null,null,null,null,null,null,null,null,null,null,null,null,null,null,null,null,null,null,null,null,null,null,null,null,null,null,null,2200,{"$f":"AK68*E68","v":0}]
["0106001","Abreu",0,0,null,null,null,null,null,null,null,null,null,null,null,null,null,null,null,null,null,null,null,null,null,null,null,null,null,null,null,null,null,null,null,null,1480,{"$f":"AK69*E69","v":0}]
[null,"TOTAL ARANCEL MAI",{"$f":"SUM(C65:C69)","v":0},{"$f":"SUM(D65:D69)","v":0},{"$f":"SUM(E65:E69)","v":0},{"$f":"SUM(F65:F69)","v":0},{"$f":"SUM(G65:G69)","v":0},null,null,null,null,null,null,null,null,null,null,null,null,null,null,null,null,null,null,null,{"$f":"SUM(AA65:AA69)","v":0},0,0,0,0,0,0,0,0,0,{"$f":"SUM(AK65:AK68)","v":57490},{"$f":"SUM(AL65:AL68)","v":0}]
[null,"Procedimientos de podología",0,0]
[null,"TOTAL ARANCEL MLE Y NO ARANCELADO",{"$f":"C71","v":0},{"$f":"D71","v":0},{"$f":"E71","v":0},{"$f":"F71","v":0},{"$f":"G71","v":0},null,null,null,null,null,null,null,null,null,null,null,null,null,null,null,null,null,null,null,{"$f":"AA71","v":0},0,0,0,0,0,0,0,0,0]
[null,"TOTAL PRODUCCION",{"$f":"SUM(C70+C72)","v":0},{"$f":"SUM(D70+D72)","v":0},{"$f":"SUM(E70+E72)","v":0},{"$f":"SUM(F70+F72)","v":0},{"$f":"SUM(G70+G72)","v":0},null,null,null,null,null,null,null,null,null,null,null,null,null,null,null,null,null,null,null,{"$f":"SUM(AA70+AA72)","v":0},0,0,0,0,0,0,0,{"$f":"SUM(AI70+AI72)","v":0},{"$f":"SUM(AJ70+AJ72)","v":0},{"$f":"SUM(AK70+AK72)","v":57490},{"$f":"SUM(AL70+AL72)","v":0}]
[null,"OTRAS MISCELANEOS "]
[5099048,"Hemoglucotest instantáneo",{"$f":"SUM(D75+G75)","v":0},{"$f":"SUM(E75:F75)","v":0}]
[5099008,"Actividad Básica",0,0]
[5099009,"Actividad Terapeutica",0,0]
[5099010,"Evaluacion Actividad",0,0]
[5099011,"Evaluacion  prevocacional",0,0]
[5099063,"Evaluación cognitiva",0,0]
[5099064,"Estimulación cognitiva",0,0]
[5099111,"Curacion avanzada de herida",0,0]
["0102701","Evaluación Motriz Funcional",0,0]
["0102702","Evaluación cognitiva-perceptual",0,0]
["0102703","Evaluación independencia en actividades de la vida diaria",0,0]
["0102704","Evaluación barreras arquitectónicas",0,0]
["0102705","Evaluación puesto de trabajo",0,0]
["0102706","Evaluación del desarrollo Psicomotor",0,0]
["0102707","Reentrenamiento de las funciones cognitiva-perceptual",0,0]
["0102708","Reentrenamiento de las actividades de la vida diaria",0,0]
["0102709","Reentrenamiento laboral",0,0]
[null,"Comité junta médica",0,0]
[null,"Consultorías médicas de especialidades",0,0]
[null,"Consultorías odontólogos",0,0]
[null,"Consejerias Individual por profesional de salud",0,0]
[null,"Consejerias Familiar por  profesionales de salud",0,0]
[null,"Instalación de clips en lesiones sangrantes",0,0]
[null,"Instalación vendaje compresivo (Coban)",0,0]
[null,"TOTAL",{"$f":"SUM(C75:C98)","v":0},{"$f":"SUM(D75:D98)","v":0},{"$f":"SUM(E75:E98)","v":0},{"$f":"SUM(F75:F98)","v":0},{"$f":"SUM(G75:G98)","v":0},null,null,null,null,null,null,null,null,null,null,null,null,null,null,null,null,null,null,null,{"$f":"SUM(AA75:AA98)","v":0},0,0,0,0,0,0,0,0,0]
[null,"Trasplantes"]
[null,"Estudio receptor donante cadáver ",0,{"$f":"SUM(E101:F101)","v":0}]
[null,"Estudio receptor donante vivo ",0,0]
[null,"Estudio receptores corazón-pulmón ",0,0]
[null,"Estudio pacientes trasplante medula ósea ",0,0]
[null,"Trasplante de medula autólogo",0,0]
[null,"Trasplante de medula alógeno",0,0]
[null,"Trasplante medula de cordón",0,0]
[null,"Trasplante medula aploidentico",0,0]
[null,"Trasplante de córnea (incluye procuramiento y seguimiento por un año)",0,0]
[null,"Soporte pretrasplante hepático extracorporeo por sesión ",0,0]
[null,"Mantención donante cadáver (pulmón, corazón o hígado) (muerte cerebral) ",0,0]
[null,"TOTAL",{"$f":"SUM(C101:C111)","v":0},{"$f":"SUM(D101:D111)","v":0},{"$f":"SUM(E101:E111)","v":0},{"$f":"SUM(F101:F111)","v":0},{"$f":"SUM(G101:G111)","v":0},null,null,null,null,null,null,null,null,null,null,null,null,null,null,null,null,null,null,null,{"$f":"SUM(AA101:AA111)","v":0},{"$f":"SUM(AB101:AB111)","v":0},0,0,0,0,0,0,0,0]
[null,"ATENCION CERRADA "]
["0203001","Día cama hospitalización integral medicina, cirugía, pediatría, obstetricia-ginecología y especialidades (sala 3 camas o más) (Hosp. Alta Complejidad)",0,{"$f":"SUM(E114:F114)","v":0},null,null,null,null,null,null,null,null,null,null,null,null,null,null,null,null,null,null,null,null,null,null,null,null,null,null,null,null,null,null,null,null,36360,{"$f":"AK114*E114","v":0}]
["0203102","Día cama hospitalización integral medicina, cirugía, pediatría, obstetricia-ginecología y especialidades (sala 3 camas o más) (Hosp. Mediana Complejidad)",0,{"$f":"SUM(E115:F115)","v":0},null,null,null,null,null,null,null,null,null,null,null,null,null,null,null,null,null,null,null,null,null,null,null,null,null,null,null,null,null,null,null,null,33480,0]
["0203103","Día cama hospitalización integral medicina, cirugía, pediatría, obstetricia-ginecología y especialidades (sala 3 camas o más) (Hosp. Baja Complejidad)",0,0,null,null,null,null,null,null,null,null,null,null,null,null,null,null,null,null,null,null,null,null,null,null,null,null,null,null,null,null,null,null,null,null,27900,0]
["0203002","Día cama hospitalización integral adulto en Unidad de Cuidado Intensivo (U.C.I.) ",0,0,null,null,null,null,null,null,null,null,null,null,null,null,null,null,null,null,null,null,null,null,null,null,null,null,null,null,null,null,null,null,null,null,151180,0]
["0203003","Día cama hospitalización integral pediátrica en Unidad de Cuidado Intensivo (U.C.I). ",0,0,null,null,null,null,null,null,null,null,null,null,null,null,null,null,null,null,null,null,null,null,null,null,null,null,null,null,null,null,null,null,null,null,151180,0]
["0203004","Día cama hospitalización integral neonatal en Unidad de Cuidado Intensivo (U.C.I.)",0,0,null,null,null,null,null,null,null,null,null,null,null,null,null,null,null,null,null,null,null,null,null,null,null,null,null,null,null,null,null,null,null,null,151180,0]
["0203005","Día cama hospitalización integral adulto en Unidad de Tratamiento Intermedio (U.T.I)",0,0,null,null,null,null,null,null,null,null,null,null,null,null,null,null,null,null,null,null,null,null,null,null,null,null,null,null,null,null,null,null,null,null,73020,0]
["0203006","Día cama hospitalización integral pediátrica en Unidad de Tratamiento Intermedio (U.T.I)",0,0,null,null,null,null,null,null,null,null,null,null,null,null,null,null,null,null,null,null,null,null,null,null,null,null,null,null,null,null,null,null,null,null,73020,0]
["0203007","Día cama hospitalización integral neonatal en Unidad de Tratamiento Intermedio (U.T.I)",0,0,null,null,null,null,null,null,null,null,null,null,null,null,null,null,null,null,null,null,null,null,null,null,null,null,null,null,null,null,null,null,null,null,73020,0]
["0203008","Día cama hospitalización integral incubadora",0,0,null,null,null,null,null,null,null,null,null,null,null,null,null,null,null,null,null,null,null,null,null,null,null,null,null,null,null,null,null,null,null,null,65510,0]
["0203009","Día cama hospitalización integral psiquiatría crónicos",0,0,null,null,null,null,null,null,null,null,null,null,null,null,null,null,null,null,null,null,null,null,null,null,null,null,null,null,null,null,null,null,null,null,18590,0]
["0203109","Día cama hosp. integral psiquiatría corta estadía",0,0,null,null,null,null,null,null,null,null,null,null,null,null,null,null,null,null,null,null,null,null,null,null,null,null,null,null,null,null,null,null,null,null,29130,0]
["0203209","Día cama hosp. integral desintoxicación alcohol y drogas",0,0,null,null,null,null,null,null,null,null,null,null,null,null,null,null,null,null,null,null,null,null,null,null,null,null,null,null,null,null,null,null,null,null,30320,0]
[null,"TOTAL",{"$f":"SUM(C114:C126)","v":0},{"$f":"SUM(D114:D126)","v":0},{"$f":"SUM(E114:E126)","v":0},{"$f":"SUM(F114:F126)","v":0},{"$f":"SUM(G114:G126)","v":0},null,null,null,null,null,null,null,null,null,null,null,null,null,null,null,null,null,null,null,{"$f":"SUM(AA114:AA126)","v":0},{"$f":"SUM(AB114:AB126)","v":0},0,0,0,0,0,0,0,0,913890,0]
[null,"MISCELANEOS  DIA CAMA                                                                                         "]
["0203010","Día cama integral psiquiátrico diurno",0,{"$f":"SUM(E129:F129)","v":0},null,null,null,null,null,null,null,null,null,null,null,null,null,null,null,null,null,null,null,null,null,null,null,null,null,null,null,null,null,null,null,null,12220,{"$f":"AK129*E129","v":0}]
["0203110","Día cama hospitalización integral psiquiatría mediana estadía",0,0,null,null,null,null,null,null,null,null,null,null,null,null,null,null,null,null,null,null,null,null,null,null,null,null,null,null,null,null,null,null,null,null,29370,0]
["0203011","Día cama integral de observación o día cama integral ambulatorio diurno",0,0,null,null,null,null,null,null,null,null,null,null,null,null,null,null,null,null,null,null,null,null,null,null,null,null,null,null,null,null,null,null,null,null,12220,0]
["0203111","Camilla de observación en servicio de urgencia",0,0,null,null,null,null,null,null,null,null,null,null,null,null,null,null,null,null,null,null,null,null,null,null,null,null,null,null,null,null,null,null,null,null,5390,0]
["0203012","Día cama integral geriatría o crónicos",0,0,null,null,null,null,null,null,null,null,null,null,null,null,null,null,null,null,null,null,null,null,null,null,null,null,null,null,null,null,null,null,null,null,36360,0]
["0203013","Día estada en cámara hiperbárica",0,0,null,null,null,null,null,null,null,null,null,null,null,null,null,null,null,null,null,null,null,null,null,null,null,null,null,null,null,null,null,null,null,null,98300,0]
["0203014","Día cama hogar embarazada rural (del Servicio de Salud)",0,0,null,null,null,null,null,null,null,null,null,null,null,null,null,null,null,null,null,null,null,null,null,null,null,null,null,null,null,null,null,null,null,null,11610,0]
["0203015","Día cuna de hospitalización integral",0,0,null,null,null,null,null,null,null,null,null,null,null,null,null,null,null,null,null,null,null,null,null,null,null,null,null,null,null,null,null,null,null,null,7060,0]
["0203016","Día cama hospitalización integral urgencia H.U.A.P. (Sólo Hospital Urgencia Asistencia Pública)",0,0,null,null,null,null,null,null,null,null,null,null,null,null,null,null,null,null,null,null,null,null,null,null,null,null,null,null,null,null,null,null,null,null,50960,0]
["0203017","Día cama hogar protegido paciente psiquiátrico compensado",0,0,null,null,null,null,null,null,null,null,null,null,null,null,null,null,null,null,null,null,null,null,null,null,null,null,null,null,null,null,null,null,null,null,8940,0]
[null,"TOTAL ARANCEL MAI",{"$f":"SUM(C129:C138)","v":0},{"$f":"SUM(D129:D138)","v":0},{"$f":"SUM(E129:E138)","v":0},{"$f":"SUM(F129:F138)","v":0},{"$f":"SUM(G129:G138)","v":0},null,null,null,null,null,null,null,null,null,null,null,null,null,null,null,null,null,null,null,{"$f":"SUM(AA129:AA138)","v":0},{"$f":"SUM(AB129:AB138)","v":0},0,0,0,0,0,0,0,0,272430,0]
["\"0203211","Día Cama Residencia Protegida",{"$f":"SUM(D140+G140)","v":0},{"$f":"SUM(E140:F140)","v":0}]
["\"0202101","Día Cama de Hospitalización Medicina y Especialidades (sala 3 camas o más de pensionado o medio pensionado).",{"$f":"SUM(D141+G141)","v":0},{"$f":"SUM(E141:F141)","v":0}]
["0202105","Día Cama de Hospitalización Cirugía (sala 3 camas o más de pensionado o medio pensionado)",0,0]
["0202109","Día Cama de Hospitalización Pediatría (sala 3 camas o más de pensionado o medio pensionado)",0,0]
["0202113","Día Cama de Hospitalización Obstetricia y Ginecología (sala 3 camas o más de pensionado o medio pensionado)",0,0]
[null,"TOTAL ARANCEL MLE Y NO ARANCELADO",{"$f":"SUM(C140:C144)","v":0},{"$f":"SUM(D140:D144)","v":0},0,0,0,null,null,null,null,null,null,null,null,null,null,null,null,null,null,null,null,null,null,null,{"$f":"AA140","v":0},0,0,0,0,0,0,0,0,0]
[null,"TOTAL PRODUCCION",{"$f":"SUM(C139+C145)","v":0},{"$f":"SUM(D139+D145)","v":0},{"$f":"SUM(E139+E145)","v":0},{"$f":"SUM(F139+F145)","v":0},{"$f":"SUM(G139+G145)","v":0},null,null,null,null,null,null,null,null,null,null,null,null,null,null,null,null,null,null,null,{"$f":"SUM(AA139+AA145)","v":0},0,0,0,0,0,0,0,0,0,{"$f":"SUM(AK139+AK145)","v":272430},{"$f":"SUM(AL139+AL145)","v":0}]
["","EXAMENES DE LABORATORIO  "]
["","I.- SANGRE, HEMATOLOGIA"]
["0301002","Acido fólico o folatos",6,{"$f":"SUM(E149:F149)","v":4},2,2,2,null,null,null,null,null,null,null,null,null,null,null,null,null,null,null,null,null,null,null,null,null,null,null,null,null,null,null,null,null,3860,{"$f":"AK149*E149","v":7720}]
["0301003","Adenograma, mielograma, c/u",{"$f":"SUM(D150+G150)","v":6},{"$f":"SUM(E150:F150)","v":4},2,2,2,null,null,null,null,null,null,null,null,null,null,null,null,null,null,null,null,null,null,null,null,null,null,null,null,null,null,null,null,null,4800,9600]
["0301005","Aglutininas anti Rho",6,4,2,2,2,null,null,null,null,null,null,null,null,null,null,null,null,null,null,null,null,null,null,null,null,null,null,null,null,null,null,null,null,null,3440,6880]
["0301006","Agregación plaquetaria con diferentes agonistas",6,4,2,2,2,null,null,null,null,null,null,null,null,null,null,null,null,null,null,null,null,null,null,null,null,null,null,null,null,null,null,null,null,null,3440,6880]
["0301007","Anticoagulantes circulantes o anticoagulante lúpico",6,4,2,2,2,null,null,null,null,null,null,null,null,null,null,null,null,null,null,null,null,null,null,null,null,null,null,null,null,null,null,null,null,null,3440,6880]
["0301008","Antitrombina III",6,4,2,2,2,null,null,null,null,null,null,null,null,null,null,null,null,null,null,null,null,null,null,null,null,null,null,null,null,null,null,null,null,null,3440,6880]
["0301011","Coagulación, tiempo de",6,4,2,2,2,null,null,null,null,null,null,null,null,null,null,null,null,null,null,null,null,null,null,null,null,null,null,null,null,null,null,null,null,null,1190,2380]
["0301013","Tiempo de lisis del coágulo",6,4,2,2,2,null,null,null,null,null,null,null,null,null,null,null,null,null,null,null,null,null,null,null,null,null,null,null,null,null,null,null,null,null,460,920]
["0301014","Prueba de antiglobulina directa",6,4,2,2,2,null,null,null,null,null,null,null,null,null,null,null,null,null,null,null,null,null,null,null,null,null,null,null,null,null,null,null,null,null,940,1880]
["0301015","Coombs indirecto, prueba de",6,4,2,2,2,null,null,null,null,null,null,null,null,null,null,null,null,null,null,null,null,null,null,null,null,null,null,null,null,null,null,null,null,null,1720,3440]
["0301017","Deshidrogenasa glucosa-6-fosfato en eritrocitos",6,4,2,2,2,null,null,null,null,null,null,null,null,null,null,null,null,null,null,null,null,null,null,null,null,null,null,null,null,null,null,null,null,null,3610,7220]
["0301020","Tiempo de lisis de euglobulinas",6,4,2,2,2,null,null,null,null,null,null,null,null,null,null,null,null,null,null,null,null,null,null,null,null,null,null,null,null,null,null,null,null,null,1190,2380]
["0301021","Fibrinógeno",6,4,2,2,2,null,null,null,null,null,null,null,null,null,null,null,null,null,null,null,null,null,null,null,null,null,null,null,null,null,null,null,null,null,1720,3440]
["0301022","Test de neutralización plaquetaria",6,4,2,2,2,null,null,null,null,null,null,null,null,null,null,null,null,null,null,null,null,null,null,null,null,null,null,null,null,null,null,null,null,null,3440,6880]
["0301024","Factor V",6,4,2,2,2,null,null,null,null,null,null,null,null,null,null,null,null,null,null,null,null,null,null,null,null,null,null,null,null,null,null,null,null,null,1720,3440]
["0301025","Factores VII, VIII, IX, X, XI, XII, XIII, c/u",6,4,2,2,2,null,null,null,null,null,null,null,null,null,null,null,null,null,null,null,null,null,null,null,null,null,null,null,null,null,null,null,null,null,3610,7220]
["0301026","Ferritina",6,4,2,2,2,null,null,null,null,null,null,null,null,null,null,null,null,null,null,null,null,null,null,null,null,null,null,null,null,null,null,null,null,null,4390,8780]
["0301027","Fibrinógeno, productos de degradación del",6,4,2,2,2,null,null,null,null,null,null,null,null,null,null,null,null,null,null,null,null,null,null,null,null,null,null,null,null,null,null,null,null,null,3610,7220]
["0301028","Fierro sérico",6,4,2,2,2,null,null,null,null,null,null,null,null,null,null,null,null,null,null,null,null,null,null,null,null,null,null,null,null,null,null,null,null,null,1720,3440]
["0301029","Fierro, capacidad de fijación del (incluye fierro sérico)",6,4,2,2,2,null,null,null,null,null,null,null,null,null,null,null,null,null,null,null,null,null,null,null,null,null,null,null,null,null,null,null,null,null,3610,7220]
["0301030","Fierro, cinética del (cada determinación)",6,4,2,2,2,null,null,null,null,null,null,null,null,null,null,null,null,null,null,null,null,null,null,null,null,null,null,null,null,null,null,null,null,null,4390,8780]
["0301033","Grupos menores. Tipificación o determinación de otros sistemas sanguíneos (Kell, Duffy, Kidd y otros) c/u.",6,4,2,2,2,null,null,null,null,null,null,null,null,null,null,null,null,null,null,null,null,null,null,null,null,null,null,null,null,null,null,null,null,null,2120,4240]
["0301034","Clasificación sanguínea AB0 y RhD",6,4,2,2,2,null,null,null,null,null,null,null,null,null,null,null,null,null,null,null,null,null,null,null,null,null,null,null,null,null,null,null,null,null,1950,3900]
["0301035","Haptoglobina cuantitativa",6,4,2,2,2,null,null,null,null,null,null,null,null,null,null,null,null,null,null,null,null,null,null,null,null,null,null,null,null,null,null,null,null,null,3250,6500]
["0301036","Hematocrito (proc. aut.)",6,4,2,2,2,null,null,null,null,null,null,null,null,null,null,null,null,null,null,null,null,null,null,null,null,null,null,null,null,null,null,null,null,null,540,1080]
["0301038","Hemoglobina en sangre total (proc. aut.)",6,4,2,2,2,null,null,null,null,null,null,null,null,null,null,null,null,null,null,null,null,null,null,null,null,null,null,null,null,null,null,null,null,null,540,1080]
["0301039","Hemoglobina fetal cualitativa",6,4,2,2,2,null,null,null,null,null,null,null,null,null,null,null,null,null,null,null,null,null,null,null,null,null,null,null,null,null,null,null,null,null,540,1080]
["0301040","Hemoglobina fetal cuantitativa en eritrocitos",6,4,2,2,2,null,null,null,null,null,null,null,null,null,null,null,null,null,null,null,null,null,null,null,null,null,null,null,null,null,null,null,null,null,3610,7220]
["0301041","Hemoglobina glicada A1c",0,0,null,null,null,null,null,null,null,null,null,null,null,null,null,null,null,null,null,null,null,null,null,null,null,null,null,null,null,null,null,null,null,null,3750,0]
["0301042","Hemoglobina plasmática",0,0,null,null,null,null,null,null,null,null,null,null,null,null,null,null,null,null,null,null,null,null,null,null,null,null,null,null,null,null,null,null,null,null,730,0]
["0301044","Electroforesis de hemoglobina",0,0,null,null,null,null,null,null,null,null,null,null,null,null,null,null,null,null,null,null,null,null,null,null,null,null,null,null,null,null,null,null,null,null,3860,0]
["0301045","Hemograma (incluye recuentos de leucocitos y eritrocitos, hemoglobina, hematocrito, fórmula leucocitaria, características de los elementos figurados y velocidad de eritrosedimentación)",0,0,null,null,null,null,null,null,null,null,null,null,null,null,null,null,null,null,null,null,null,null,null,null,null,null,null,null,null,null,null,null,null,null,2470,0]
["0301048","Hemosiderina medular",0,0,null,null,null,null,null,null,null,null,null,null,null,null,null,null,null,null,null,null,null,null,null,null,null,null,null,null,null,null,null,null,null,null,730,{"$f":"AK181*E181","v":0}]
["0301049","Cuantificación de heparina",0,0,null,null,null,null,null,null,null,null,null,null,null,null,null,null,null,null,null,null,null,null,null,null,null,null,null,null,null,null,null,null,null,null,3610,0]
["0301050","Isoinmunización, detección de anticuerpos irregulares (proc. aut.).",0,0,null,null,null,null,null,null,null,null,null,null,null,null,null,null,null,null,null,null,null,null,null,null,null,null,null,null,null,null,null,null,null,null,2650,0]
["0301051","Identificación de anticuerpos irregulares eritrocitarios",0,0,null,null,null,null,null,null,null,null,null,null,null,null,null,null,null,null,null,null,null,null,null,null,null,null,null,null,null,null,null,null,null,null,3610,0]
["0301054","Metahemoglobina",0,0,null,null,null,null,null,null,null,null,null,null,null,null,null,null,null,null,null,null,null,null,null,null,null,null,null,null,null,null,null,null,null,null,940,0]
["0301059","Tiempo de protrombina (incluye INR, Razón Internacional Normalizada)",0,0,null,null,null,null,null,null,null,null,null,null,null,null,null,null,null,null,null,null,null,null,null,null,null,null,null,null,null,null,null,null,null,null,1190,0]
["0301062","Recuento de basófilos (absoluto)",0,0,null,null,null,null,null,null,null,null,null,null,null,null,null,null,null,null,null,null,null,null,null,null,null,null,null,null,null,null,null,null,null,null,730,0]
["0301063","Recuento de eosinófilos (absoluto)",0,0,null,null,null,null,null,null,null,null,null,null,null,null,null,null,null,null,null,null,null,null,null,null,null,null,null,null,null,null,null,null,null,null,730,0]
["0301064","Recuento de eritrocitos, absoluto (proc. aut.)",0,0,null,null,null,null,null,null,null,null,null,null,null,null,null,null,null,null,null,null,null,null,null,null,null,null,null,null,null,null,null,null,null,null,540,0]
["0301065","Recuento de leucocitos, absoluto (proc. aut.)",0,0,null,null,null,null,null,null,null,null,null,null,null,null,null,null,null,null,null,null,null,null,null,null,null,null,null,null,null,null,null,null,null,null,540,0]
["0301066","Recuento de linfocitos (absoluto)",0,0,null,null,null,null,null,null,null,null,null,null,null,null,null,null,null,null,null,null,null,null,null,null,null,null,null,null,null,null,null,null,null,null,940,0]
["0301067","Recuento de plaquetas (absoluto)",0,0,null,null,null,null,null,null,null,null,null,null,null,null,null,null,null,null,null,null,null,null,null,null,null,null,null,null,null,null,null,null,null,null,940,0]
["0301068","Recuento de reticulocitos (absoluto o porcentual)",0,0,null,null,null,null,null,null,null,null,null,null,null,null,null,null,null,null,null,null,null,null,null,null,null,null,null,null,null,null,null,null,null,null,730,0]
["0301069","Recuento diferencial o fórmula leucocitaria (proc. aut.)",{"$f":"SUM(D194+G194)","v":0},{"$f":"SUM(E194:F194)","v":0},null,null,null,null,null,null,null,null,null,null,null,null,null,null,null,null,null,null,null,null,null,null,null,null,null,null,null,null,null,null,null,null,1470,0]
["0301070","Resistencia globular osmótica",0,0,null,null,null,null,null,null,null,null,null,null,null,null,null,null,null,null,null,null,null,null,null,null,null,null,null,null,null,null,null,null,null,null,2420,0]
["0301072","Tiempo de sangria (no incluye dispositivo asociado)",0,0,null,null,null,null,null,null,null,null,null,null,null,null,null,null,null,null,null,null,null,null,null,null,null,null,null,null,null,null,null,null,null,null,1190,0]
["0301075","Subgrupo ABO y Rh fenotipo - genotipo Rh, c/u",0,0,null,null,null,null,null,null,null,null,null,null,null,null,null,null,null,null,null,null,null,null,null,null,null,null,null,null,null,null,null,null,null,null,2120,0]
["0301082","Transferrina",0,0,null,null,null,null,null,null,null,null,null,null,null,null,null,null,null,null,null,null,null,null,null,null,null,null,null,null,null,null,null,null,null,null,4270,0]
["0301083","Trombina, tiempo de",0,0,null,null,null,null,null,null,null,null,null,null,null,null,null,null,null,null,null,null,null,null,null,null,null,null,null,null,null,null,null,null,null,null,1470,0]
["0301085","Tromboplastina, tiempo parcial de (TTPA, TTPK o similares)",0,0,null,null,null,null,null,null,null,null,null,null,null,null,null,null,null,null,null,null,null,null,null,null,null,null,null,null,null,null,null,null,null,null,1880,0]
["0301086","Velocidad de eritrosedimentación (proc. aut.)",0,0,null,null,null,null,null,null,null,null,null,null,null,null,null,null,null,null,null,null,null,null,null,null,null,null,null,null,null,null,null,null,null,null,450,0]
["0301089","Factor Von Willebrand antigénico (FVW:Ag)",0,0,null,null,null,null,null,null,null,null,null,null,null,null,null,null,null,null,null,null,null,null,null,null,null,null,null,null,null,null,null,null,null,null,6920,0]
["0301090","Factor Von Willebrand antigénico Cofactor Ristocetina (FVW:CoRis)",0,0,null,null,null,null,null,null,null,null,null,null,null,null,null,null,null,null,null,null,null,null,null,null,null,null,null,null,null,null,null,null,null,null,6920,0]
["0301091","Proteína C",0,0,null,null,null,null,null,null,null,null,null,null,null,null,null,null,null,null,null,null,null,null,null,null,null,null,null,null,null,null,null,null,null,null,23740,0]
["0301092","Proteína S",0,0,null,null,null,null,null,null,null,null,null,null,null,null,null,null,null,null,null,null,null,null,null,null,null,null,null,null,null,null,null,null,null,null,25860,0]
["0301093","Resistencia a la Proteina C activada ",0,0,null,null,null,null,null,null,null,null,null,null,null,null,null,null,null,null,null,null,null,null,null,null,null,null,null,null,null,null,null,null,null,null,16960,0]
["0301094","Estudio de la hemoglobinuria paroxística nocturna (HPN) por citometría de flujo",0,0,null,null,null,null,null,null,null,null,null,null,null,null,null,null,null,null,null,null,null,null,null,null,null,null,null,null,null,null,null,null,null,null,36610,0]
["0301095","Dímero-D",0,0,null,null,null,null,null,null,null,null,null,null,null,null,null,null,null,null,null,null,null,null,null,null,null,null,null,null,null,null,null,null,null,null,8040,0]
[null,"TOTAL",{"$f":"SUM(C149:C208)","v":168},{"$f":"SUM(D149:D208)","v":112},{"$f":"SUM(E149:E208)","v":56},{"$f":"SUM(F149:F208)","v":56},{"$f":"SUM(G149:G208)","v":56},null,null,null,null,null,null,null,null,null,null,null,null,null,null,null,null,null,null,null,{"$f":"SUM(AA149:AA208)","v":0},0,0,0,0,0,0,0,0,0,{"$f":"SUM(AK149:AK208)","v":241300},{"$f":"SUM(AL149:AL208)","v":144580}]
[null,"II.- SANGRE, EXAMENES BIOQUIMICOS  "]
["0302001","Cuerpos cetónicos en sangre",0,0,null,null,null,null,null,null,null,null,null,null,null,null,null,null,null,null,null,null,null,null,null,null,null,null,null,null,null,null,null,null,null,null,660,{"$f":"AK211*E211","v":0}]
["0302002","Acido cítrico",0,0,null,null,null,null,null,null,null,null,null,null,null,null,null,null,null,null,null,null,null,null,null,null,null,null,null,null,null,null,null,null,null,null,1870,0]
["0302004","Lactato en sangre",0,0,null,null,null,null,null,null,null,null,null,null,null,null,null,null,null,null,null,null,null,null,null,null,null,null,null,null,null,null,null,null,null,null,3070,0]
["0302005","Acido úrico, en sangre",0,0,null,null,null,null,null,null,null,null,null,null,null,null,null,null,null,null,null,null,null,null,null,null,null,null,null,null,null,null,null,null,null,null,1300,0]
["0302008","Amilasa, en sangre",0,0,null,null,null,null,null,null,null,null,null,null,null,null,null,null,null,null,null,null,null,null,null,null,null,null,null,null,null,null,null,null,null,null,1910,0]
["0302009","Aminoácidos, cualitativo, en sangre",0,0,null,null,null,null,null,null,null,null,null,null,null,null,null,null,null,null,null,null,null,null,null,null,null,null,null,null,null,null,null,null,null,null,4530,0]
["0302010","Amonio",0,0,null,null,null,null,null,null,null,null,null,null,null,null,null,null,null,null,null,null,null,null,null,null,null,null,null,null,null,null,null,null,null,null,1720,0]
["0302070","Apolipoproteínas (A1, B u otras)",0,0,null,null,null,null,null,null,null,null,null,null,null,null,null,null,null,null,null,null,null,null,null,null,null,null,null,null,null,null,null,null,null,null,5280,0]
["0302011","Bicarbonato (proc. aut.)",0,0,null,null,null,null,null,null,null,null,null,null,null,null,null,null,null,null,null,null,null,null,null,null,null,null,null,null,null,null,null,null,null,null,540,0]
["0302012","Bilirrubina total (proc. aut.)",0,0,null,null,null,null,null,null,null,null,null,null,null,null,null,null,null,null,null,null,null,null,null,null,null,null,null,null,null,null,null,null,null,null,1070,0]
["0302013","Bilirrubina total y conjugada",0,0,null,null,null,null,null,null,null,null,null,null,null,null,null,null,null,null,null,null,null,null,null,null,null,null,null,null,null,null,null,null,null,null,1190,0]
["0302015","Calcio, en sangre",0,0,null,null,null,null,null,null,null,null,null,null,null,null,null,null,null,null,null,null,null,null,null,null,null,null,null,null,null,null,null,null,null,null,940,0]
["0302017","Caroteno",0,0,null,null,null,null,null,null,null,null,null,null,null,null,null,null,null,null,null,null,null,null,null,null,null,null,null,null,null,null,null,null,null,null,1720,0]
["0302018","Caroteno, prueba de sobrecarga de (incluye tomas de muestra)",0,0,null,null,null,null,null,null,null,null,null,null,null,null,null,null,null,null,null,null,null,null,null,null,null,null,null,null,null,null,null,null,null,null,3860,0]
["0302019","Ceruloplasmina",0,0,null,null,null,null,null,null,null,null,null,null,null,null,null,null,null,null,null,null,null,null,null,null,null,null,null,null,null,null,null,null,null,null,2640,0]
["0302020","Cobre en sangre",0,0,null,null,null,null,null,null,null,null,null,null,null,null,null,null,null,null,null,null,null,null,null,null,null,null,null,null,null,null,null,null,null,null,1260,0]
["0302067","Colesterol total (proc. aut.)",0,0,null,null,null,null,null,null,null,null,null,null,null,null,null,null,null,null,null,null,null,null,null,null,null,null,null,null,null,null,null,null,null,null,1120,0]
["0302068","Colesterol HDL (proc. aut.)",0,0,null,null,null,null,null,null,null,null,null,null,null,null,null,null,null,null,null,null,null,null,null,null,null,null,null,null,null,null,null,null,null,null,1660,0]
["0302021","Colinesterasa en suero o plasma",0,0,null,null,null,null,null,null,null,null,null,null,null,null,null,null,null,null,null,null,null,null,null,null,null,null,null,null,null,null,null,null,null,null,2410,0]
["0302023","Creatinina, en sangre",0,0,null,null,null,null,null,null,null,null,null,null,null,null,null,null,null,null,null,null,null,null,null,null,null,null,null,null,null,null,null,null,null,null,1090,0]
["0302024","Clearance de creatinina (proc.aut.)",0,0,null,null,null,null,null,null,null,null,null,null,null,null,null,null,null,null,null,null,null,null,null,null,null,null,null,null,null,null,null,null,null,null,2410,0]
["0302025","Creatinquinasa CK - MB  miocárdica",0,0,null,null,null,null,null,null,null,null,null,null,null,null,null,null,null,null,null,null,null,null,null,null,null,null,null,null,null,null,null,null,null,null,3860,0]
["0302026","Creatinquinasa CK - total",0,0,null,null,null,null,null,null,null,null,null,null,null,null,null,null,null,null,null,null,null,null,null,null,null,null,null,null,null,null,null,null,null,null,2950,0]
["0302027","Troponina                         ",0,0,null,null,null,null,null,null,null,null,null,null,null,null,null,null,null,null,null,null,null,null,null,null,null,null,null,null,null,null,null,null,null,null,8040,0]
["0302030","Deshidrogenasa láctica total (LDH)",0,0,null,null,null,null,null,null,null,null,null,null,null,null,null,null,null,null,null,null,null,null,null,null,null,null,null,null,null,null,null,null,null,null,1760,0]
["0302031","Deshidrogenasa láctica total (LDH), con separación de isoenzimas",0,0,null,null,null,null,null,null,null,null,null,null,null,null,null,null,null,null,null,null,null,null,null,null,null,null,null,null,null,null,null,null,null,null,4800,0]
["0302032","Electrolitos plasmáticos (sodio, potasio, cloro) c/u",0,0,null,null,null,null,null,null,null,null,null,null,null,null,null,null,null,null,null,null,null,null,null,null,null,null,null,null,null,null,null,null,null,null,1010,0]
["0302033","Enzima convertidora de angiotensina I",0,0,null,null,null,null,null,null,null,null,null,null,null,null,null,null,null,null,null,null,null,null,null,null,null,null,null,null,null,null,null,null,null,null,4800,0]
["0302034","Perfil lipídico (incluye mediciones de colesterol total, HDL-colesterol y trigliceridos con estimaciones por fórmula de LDL-colesterol, VLDL-colesterol y colesterol no-HDL)",0,0,null,null,null,null,null,null,null,null,null,null,null,null,null,null,null,null,null,null,null,null,null,null,null,null,null,null,null,null,null,null,null,null,5110,0]
["0302035","Fármacos y/o drogas; niveles plasmáticos de (alcohol, anorexígenos, antiarrítmicos, antibióticos, antidepresivos, antiepilépticos, antihistamínicos, antiinflamatorios y analgésicos, estimulantes respiratorios, tranquilizantes mayores y menores, etc.) c/u",0,0,null,null,null,null,null,null,null,null,null,null,null,null,null,null,null,null,null,null,null,null,null,null,null,null,null,null,null,null,null,null,null,null,4590,0]
["0302036","Fenilalanina",{"$f":"SUM(D241+G241)","v":0},{"$f":"SUM(E241:F241)","v":0},null,null,null,null,null,null,null,null,null,null,null,null,null,null,null,null,null,null,null,null,null,null,null,null,null,null,null,null,null,null,null,null,1720,0]
["0302039","Fosfatasas alcalinas con separación de isoenzimas hepáticas, intestinales, óseas c/u",0,0,null,null,null,null,null,null,null,null,null,null,null,null,null,null,null,null,null,null,null,null,null,null,null,null,null,null,null,null,null,null,null,null,4670,0]
["0302040","Fosfatasas alcalinas totales",0,0,null,null,null,null,null,null,null,null,null,null,null,null,null,null,null,null,null,null,null,null,null,null,null,null,null,null,null,null,null,null,null,null,1100,{"$f":"AK243*E243","v":0}]
["0302042","Fósforo (fosfatos), en sangre",0,0,null,null,null,null,null,null,null,null,null,null,null,null,null,null,null,null,null,null,null,null,null,null,null,null,null,null,null,null,null,null,null,null,1420,0]
["0302043","Galactosa",0,0,null,null,null,null,null,null,null,null,null,null,null,null,null,null,null,null,null,null,null,null,null,null,null,null,null,null,null,null,null,null,null,null,540,0]
["0302045","Gamma glutamiltranspeptidasa (GGT)",0,0,null,null,null,null,null,null,null,null,null,null,null,null,null,null,null,null,null,null,null,null,null,null,null,null,null,null,null,null,null,null,null,null,1820,0]
["0302046","Gases y equilibrio ácido base en sangre (incluye: pH, O2, CO2, exceso de base y bicarbonato), todos o cada uno de los parámetros",0,0,null,null,null,null,null,null,null,null,null,null,null,null,null,null,null,null,null,null,null,null,null,null,null,null,null,null,null,null,null,null,null,null,3050,0]
["0302047","Glucosa, en sangre",0,0,null,null,null,null,null,null,null,null,null,null,null,null,null,null,null,null,null,null,null,null,null,null,null,null,null,null,null,null,null,null,null,null,1090,0]
["0302048","Glucosa, Prueba de Tolerancia a la Glucosa Oral (PTGO), (dos determinaciones) (no incluye la glucosa que se administra) (incluye el valor de las dos tomas de muestras)",0,0,null,null,null,null,null,null,null,null,null,null,null,null,null,null,null,null,null,null,null,null,null,null,null,null,null,null,null,null,null,null,null,null,4900,0]
["0302050","Adenosindeaminasa en sangre u otro fluído biológico.",0,0,null,null,null,null,null,null,null,null,null,null,null,null,null,null,null,null,null,null,null,null,null,null,null,null,null,null,null,null,null,null,null,null,3610,0]
["0302052","Leucinaminopeptidasa (LAP)",0,0,null,null,null,null,null,null,null,null,null,null,null,null,null,null,null,null,null,null,null,null,null,null,null,null,null,null,null,null,null,null,null,null,1720,0]
["0302053","Lipasa en sangre",0,0,null,null,null,null,null,null,null,null,null,null,null,null,null,null,null,null,null,null,null,null,null,null,null,null,null,null,null,null,null,null,null,null,1870,0]
["0302055","Litio en sangre",0,0,null,null,null,null,null,null,null,null,null,null,null,null,null,null,null,null,null,null,null,null,null,null,null,null,null,null,null,null,null,null,null,null,2410,0]
["0302056","Magnesio en sangre",0,0,null,null,null,null,null,null,null,null,null,null,null,null,null,null,null,null,null,null,null,null,null,null,null,null,null,null,null,null,null,null,null,null,2410,0]
["0302057","Nitrógeno ureico y/o úrea, en sangre",0,0,null,null,null,null,null,null,null,null,null,null,null,null,null,null,null,null,null,null,null,null,null,null,null,null,null,null,null,null,null,null,null,null,1090,0]
["0302058","Osmolalidad en sangre",0,0,null,null,null,null,null,null,null,null,null,null,null,null,null,null,null,null,null,null,null,null,null,null,null,null,null,null,null,null,null,null,null,null,1380,0]
["0302075","Perfil bioquímico (determinación automatizada de 12 parámetros)",0,0,null,null,null,null,null,null,null,null,null,null,null,null,null,null,null,null,null,null,null,null,null,null,null,null,null,null,null,null,null,null,null,null,6920,0]
["0302060","Proteínas totales o albúminas, c/u, en sangre",0,0,null,null,null,null,null,null,null,null,null,null,null,null,null,null,null,null,null,null,null,null,null,null,null,null,null,null,null,null,null,null,null,null,1180,0]
["0302061","Proteínas, electroforesis (incluye cód. 03-02-060)",0,0,null,null,null,null,null,null,null,null,null,null,null,null,null,null,null,null,null,null,null,null,null,null,null,null,null,null,null,null,null,null,null,null,5020,0]
["0302076","Perfil Hepático (incluye tiempo de protrombina, bilirrubina total y conjugada, fosfatasas alcalinas totales, GGT, transaminasas GOT/AST y GPT/ALT)",0,0,null,null,null,null,null,null,null,null,null,null,null,null,null,null,null,null,null,null,null,null,null,null,null,null,null,null,null,null,null,null,null,null,8690,0]
["0302063","Transaminasas, oxalacética (GOT/AST), Pirúvica (GPT/ALT), c/u",0,0,null,null,null,null,null,null,null,null,null,null,null,null,null,null,null,null,null,null,null,null,null,null,null,null,null,null,null,null,null,null,null,null,1570,0]
["0302064","Triglicéridos en sangre (proc.aut.)",0,0,null,null,null,null,null,null,null,null,null,null,null,null,null,null,null,null,null,null,null,null,null,null,null,null,null,null,null,null,null,null,null,null,1430,0]
["0302065","Vitaminas A, B, C, D, E, etc., c/u",0,0,null,null,null,null,null,null,null,null,null,null,null,null,null,null,null,null,null,null,null,null,null,null,null,null,null,null,null,null,null,null,null,null,1430,0]
["0302066","Xilosa, prueba de absorción (no incluye la xilosa que se administra)",0,0,null,null,null,null,null,null,null,null,null,null,null,null,null,null,null,null,null,null,null,null,null,null,null,null,null,null,null,null,null,null,null,null,2550,0]
["0302077","Vitamina B12 por inmunoensayo",0,0,null,null,null,null,null,null,null,null,null,null,null,null,null,null,null,null,null,null,null,null,null,null,null,null,null,null,null,null,null,null,null,null,5840,0]
["0302078","25 OH Vitamina D Total por inmunoensayo",0,0,null,null,null,null,null,null,null,null,null,null,null,null,null,null,null,null,null,null,null,null,null,null,null,null,null,null,null,null,null,null,null,null,11630,0]
["0302079","25 OH Vitamina D Total por espectrometría de masa",0,0,null,null,null,null,null,null,null,null,null,null,null,null,null,null,null,null,null,null,null,null,null,null,null,null,null,null,null,null,null,null,null,null,11630,0]
["0302080","Vitamina B6 por HPLC",0,0,null,null,null,null,null,null,null,null,null,null,null,null,null,null,null,null,null,null,null,null,null,null,null,null,null,null,null,null,null,null,null,null,36770,0]
["0302081","Calcio iónico. Incluye medición de pH método ión selectivo. No incluye Point of Care Testing POCT",0,0,null,null,null,null,null,null,null,null,null,null,null,null,null,null,null,null,null,null,null,null,null,null,null,null,null,null,null,null,null,null,null,null,1670,0]
["0302082","Fenilalanina Cuantitativa en Gotas de Sangre Seca",0,0,null,null,null,null,null,null,null,null,null,null,null,null,null,null,null,null,null,null,null,null,null,null,null,null,null,null,null,null,null,null,null,null,6560,0]
[null,"TOTAL",{"$f":"SUM(C211:C270)","v":0},{"$f":"SUM(D211:D270)","v":0},{"$f":"SUM(E211:E270)","v":0},{"$f":"SUM(F211:F270)","v":0},{"$f":"SUM(G211:G270)","v":0},null,null,null,null,null,null,null,null,null,null,null,null,null,null,null,null,null,null,null,{"$f":"SUM(AA211:AA270)","v":0},0,0,0,0,0,0,0,0,0,{"$f":"SUM(AK211:AK270)","v":216860},{"$f":"SUM(AL211:AL270)","v":0}]
[null,"III.- HORMONAS  "]
["0303001","Adenocorticotrofina (ACTH)",0,0,null,null,null,null,null,null,null,null,null,null,null,null,null,null,null,null,null,null,null,null,null,null,null,null,null,null,null,null,null,null,null,null,6660,{"$f":"AK273*E273","v":0}]
["0303002","Aldosterona",0,0,null,null,null,null,null,null,null,null,null,null,null,null,null,null,null,null,null,null,null,null,null,null,null,null,null,null,null,null,null,null,null,null,5720,0]
["0303003","Androstenediona",0,0,null,null,null,null,null,null,null,null,null,null,null,null,null,null,null,null,null,null,null,null,null,null,null,null,null,null,null,null,null,null,null,null,4300,0]
["0303004","Angiotensina",{"$f":"SUM(D276+G276)","v":0},0,null,null,null,null,null,null,null,null,null,null,null,null,null,null,null,null,null,null,null,null,null,null,null,null,null,null,null,null,null,null,null,null,5210,0]
["0303006","Cortisol",0,0,null,null,null,null,null,null,null,null,null,null,null,null,null,null,null,null,null,null,null,null,null,null,null,null,null,null,null,null,null,null,null,null,4300,0]
["0303007","Crecimiento, hormona de (HGH) (somatotrofina)",0,0,null,null,null,null,null,null,null,null,null,null,null,null,null,null,null,null,null,null,null,null,null,null,null,null,null,null,null,null,null,null,null,null,5720,0]
["0303008","Dehidroepiandrosterona sulfato (DHEA-S)",0,0,null,null,null,null,null,null,null,null,null,null,null,null,null,null,null,null,null,null,null,null,null,null,null,null,null,null,null,null,null,null,null,null,5720,0]
["0303009","Eritropoyetina",0,0,null,null,null,null,null,null,null,null,null,null,null,null,null,null,null,null,null,null,null,null,null,null,null,null,null,null,null,null,null,null,null,null,4060,0]
["0303012","Gastrina",0,0,null,null,null,null,null,null,null,null,null,null,null,null,null,null,null,null,null,null,null,null,null,null,null,null,null,null,null,null,null,null,null,null,5720,0]
["0303014","Gonadotrofina coriónica, sub-unidad beta (cuantificación)",0,0,null,null,null,null,null,null,null,null,null,null,null,null,null,null,null,null,null,null,null,null,null,null,null,null,null,null,null,null,null,null,null,null,4260,0]
["0303015","Hormona folículo estimulante (FSH)",0,0,null,null,null,null,null,null,null,null,null,null,null,null,null,null,null,null,null,null,null,null,null,null,null,null,null,null,null,null,null,null,null,null,4260,0]
["0303016","Hormona luteinizante (LH)",0,0,null,null,null,null,null,null,null,null,null,null,null,null,null,null,null,null,null,null,null,null,null,null,null,null,null,null,null,null,null,null,null,null,4260,0]
["0303047","IGF1 o Somatomedina - C (Insuline Like Growth Factor)",0,0,null,null,null,null,null,null,null,null,null,null,null,null,null,null,null,null,null,null,null,null,null,null,null,null,null,null,null,null,null,null,null,null,9940,0]
["0303048","IGFBP3, IGFBP1 (Insulin Like Growth Factor Binding Proteins)  c/u",0,0,null,null,null,null,null,null,null,null,null,null,null,null,null,null,null,null,null,null,null,null,null,null,null,null,null,null,null,null,null,null,null,null,9940,0]
["0303017","Insulina",0,0,null,null,null,null,null,null,null,null,null,null,null,null,null,null,null,null,null,null,null,null,null,null,null,null,null,null,null,null,null,null,null,null,4260,0]
["0303031","Insulina, curva de (mínimo dos determinaciones e incluye todas las tomas de muestras necesarias.  No incluye la glucosa que se administra)",0,0,null,null,null,null,null,null,null,null,null,null,null,null,null,null,null,null,null,null,null,null,null,null,null,null,null,null,null,null,null,null,null,null,11480,0]
["0303018","Parathormona, hormona Paratiroídea o PTH.",0,0,null,null,null,null,null,null,null,null,null,null,null,null,null,null,null,null,null,null,null,null,null,null,null,null,null,null,null,null,null,null,null,null,6510,0]
["0303019","Progesterona",0,0,null,null,null,null,null,null,null,null,null,null,null,null,null,null,null,null,null,null,null,null,null,null,null,null,null,null,null,null,null,null,null,null,4260,0]
["0303020","Prolactina (PRL)",0,0,null,null,null,null,null,null,null,null,null,null,null,null,null,null,null,null,null,null,null,null,null,null,null,null,null,null,null,null,null,null,null,null,4260,0]
["0303021","Renina",0,0,null,null,null,null,null,null,null,null,null,null,null,null,null,null,null,null,null,null,null,null,null,null,null,null,null,null,null,null,null,null,null,null,5720,0]
["0303046","SHGB (Sex-Hormone Binding Globulin)",0,0,null,null,null,null,null,null,null,null,null,null,null,null,null,null,null,null,null,null,null,null,null,null,null,null,null,null,null,null,null,null,null,null,9940,0]
["0303022","Testosterona, en sangre",{"$f":"SUM(D294+G294)","v":0},{"$f":"SUM(E294:F294)","v":0},null,null,null,null,null,null,null,null,null,null,null,null,null,null,null,null,null,null,null,null,null,null,null,null,null,null,null,null,null,null,null,null,4300,0]
["0303023","Testosterona libre",0,0,null,null,null,null,null,null,null,null,null,null,null,null,null,null,null,null,null,null,null,null,null,null,null,null,null,null,null,null,null,null,null,null,5210,0]
["0303123","Índice androgénico (incluye Testosterona Total y SHBG)",{"$f":"SUM(D296+G296)","v":0},{"$f":"SUM(E296:F296)","v":0},null,null,null,null,null,null,null,null,null,null,null,null,null,null,null,null,null,null,null,null,null,null,null,null,null,null,null,null,null,null,null,null,10600,0]
["0303024","Tiroestimulante (TSH), hormona (adulto, niño o R.N.)                            ",0,0,null,null,null,null,null,null,null,null,null,null,null,null,null,null,null,null,null,null,null,null,null,null,null,null,null,null,null,null,null,null,null,null,3730,0]
["0303025","Tiroglobulina                                                                                   ",0,0,null,null,null,null,null,null,null,null,null,null,null,null,null,null,null,null,null,null,null,null,null,null,null,null,null,null,null,null,null,null,null,null,5720,0]
["0303026","Tiroxina libre (T4L)                                                                       ",0,0,null,null,null,null,null,null,null,null,null,null,null,null,null,null,null,null,null,null,null,null,null,null,null,null,null,null,null,null,null,null,null,null,4260,0]
["0303027","Tiroxina o tetrayodotironina (T4)                                               ",0,0,null,null,null,null,null,null,null,null,null,null,null,null,null,null,null,null,null,null,null,null,null,null,null,null,null,null,null,null,null,null,null,null,3730,0]
["0303028","Triyodotironina (T3)                                                               ",0,0,null,null,null,null,null,null,null,null,null,null,null,null,null,null,null,null,null,null,null,null,null,null,null,null,null,null,null,null,null,null,null,null,3730,0]
["0303029","17 – Hidroxiprogesterona",0,0,null,null,null,null,null,null,null,null,null,null,null,null,null,null,null,null,null,null,null,null,null,null,null,null,null,null,null,null,null,null,null,null,5720,0]
["0303030","Estradiol (17-Beta)",0,0,null,null,null,null,null,null,null,null,null,null,null,null,null,null,null,null,null,null,null,null,null,null,null,null,null,null,null,null,null,null,null,null,4260,0]
["0303033","Angiotensina",0,0,null,null,null,null,null,null,null,null,null,null,null,null,null,null,null,null,null,null,null,null,null,null,null,null,null,null,null,null,null,null,null,null,5210,0]
["0303035","Cortisol libre urinario",0,0,null,null,null,null,null,null,null,null,null,null,null,null,null,null,null,null,null,null,null,null,null,null,null,null,null,null,null,null,null,null,null,null,4690,0]
["0303039","Gonadotrofina coriónica, sub-unidada Beta; titulación por (Elisa; RIA o IRMA; Quimioluminiscencia u otra técnica)",0,0,null,null,null,null,null,null,null,null,null,null,null,null,null,null,null,null,null,null,null,null,null,null,null,null,null,null,null,null,null,null,null,null,4300,0]
["0303049","Catecolaminas en sangre (incluye medición de Adrenalina, Noradrenalina y Dopamina por separado por métodos cromatográficos)",0,0,null,null,null,null,null,null,null,null,null,null,null,null,null,null,null,null,null,null,null,null,null,null,null,null,null,null,null,null,null,null,null,null,25150,0]
["0303050","Metanefrinas urinarias (incluye determinación de Metanefrina y Normetanefrina por separado por métodos cromatográficos)",0,0,null,null,null,null,null,null,null,null,null,null,null,null,null,null,null,null,null,null,null,null,null,null,null,null,null,null,null,null,null,null,null,null,28440,0]
["0303051","Catecolaminas urinarias (incluye medición de Adrenalina, Noradrenalina y Dopamina por separado por métodos cromatográficos)",0,0,null,null,null,null,null,null,null,null,null,null,null,null,null,null,null,null,null,null,null,null,null,null,null,null,null,null,null,null,null,null,null,null,25150,0]
[null,"TOTAL",{"$f":"SUM(C273:C309)","v":0},{"$f":"SUM(D273:D309)","v":0},{"$f":"SUM(E273:E309)","v":0},{"$f":"SUM(F273:F309)","v":0},{"$f":"SUM(G273:G309)","v":0},null,null,null,null,null,null,null,null,null,null,null,null,null,null,null,null,null,null,null,{"$f":"SUM(AA273:AA309)","v":0},0,0,0,0,0,0,0,0,0,{"$f":"SUM(AK273:AK309)","v":270700},{"$f":"SUM(AL273:AL309)","v":0}]
[null,"IV.- GENETICA  "]
["0304001","Cariograma en sangre por cultivo de linfocitos (incluye mínimo 25 mitosis con bandeo G y eventualmente Q, R, C, NOR) (montaje de 3 metafases bandeadas)",0,0,null,null,null,null,null,null,null,null,null,null,null,null,null,null,null,null,null,null,null,null,null,null,null,null,null,null,null,null,null,null,null,null,37610,{"$f":"AK312*E312","v":0}]
["0304002","Cariograma con técnicas especiales (incluye muestra de sangre o de médula ósea, tratamiento con FUDR, bromuro de etidio, medio deficiente en ácido fólico)",0,0,null,null,null,null,null,null,null,null,null,null,null,null,null,null,null,null,null,null,null,null,null,null,null,null,null,null,null,null,null,null,null,null,40210,{"$f":"AK313*E313","v":0}]
["0304003","Cariograma en fibroblastos por cultivo de trofoblasto, líquido amniótico, piel u otros bandeos G y eventualmente Q, R, C, NOR",0,0,null,null,null,null,null,null,null,null,null,null,null,null,null,null,null,null,null,null,null,null,null,null,null,null,null,null,null,null,null,null,null,null,40210,{"$f":"AK314*E314","v":0}]
["0304006","FISH Cromosomas X e Y",0,0,null,null,null,null,null,null,null,null,null,null,null,null,null,null,null,null,null,null,null,null,null,null,null,null,null,null,null,null,null,null,null,null,53420,{"$f":"AK315*E315","v":0}]
["\"0304007","Diagnóstico Genético Molecular:Displasia Tanatofórica tipo I y II",0,0,null,null,null,null,null,null,null,null,null,null,null,null,null,null,null,null,null,null,null,null,null,null,null,null,null,null,null,null,null,null,null,null,null,{"$f":"AK316*E316","v":0}]
[null,"TOTAL",{"$f":"SUM(C312:C316)","v":0},{"$f":"SUM(D312:D316)","v":0},{"$f":"SUM(E312:E316)","v":0},{"$f":"SUM(F312:F316)","v":0},{"$f":"SUM(G312:G316)","v":0},null,null,null,null,null,null,null,null,null,null,null,null,null,null,null,null,null,null,null,{"$f":"SUM(AA312:AA316)","v":0},{"$f":"SUM(AB312:AB316)","v":0},0,0,0,0,0,0,{"$f":"SUM(AI312:AI316)","v":0},{"$f":"SUM(AJ312:AJ316)","v":0},{"$f":"SUM(AK312:AK315)","v":171450},0]
[null,"V.- INMUNOLOGIA                            "]
["0305001","Alfa -1- antitripsina cuantitativa",0,0,null,null,null,null,null,null,null,null,null,null,null,null,null,null,null,null,null,null,null,null,null,null,null,null,null,null,null,null,null,null,null,null,4300,{"$f":"AK319*E319","v":0}]
["0305002","Alfa -2- macroglobulina",0,0,null,null,null,null,null,null,null,null,null,null,null,null,null,null,null,null,null,null,null,null,null,null,null,null,null,null,null,null,null,null,null,null,4170,0]
["0305003","Alfa fetoproteínas",0,0,null,null,null,null,null,null,null,null,null,null,null,null,null,null,null,null,null,null,null,null,null,null,null,null,null,null,null,null,null,null,null,null,4260,0]
["0305004","Tamizaje de Anticuerpos anti antígenos nucleares extractables (a- ENA: Sm, RNP, Ro, La, Scl- 70 y Jo- 1)",0,0,null,null,null,null,null,null,null,null,null,null,null,null,null,null,null,null,null,null,null,null,null,null,null,null,null,null,null,null,null,null,null,null,8530,0]
["0305005","Anticuerpos antinucleares (ANA), antimitocondriales, anti DNA (ADNA), anti músculo liso, anticentrómero, u otros, c/u.",0,0,null,null,null,null,null,null,null,null,null,null,null,null,null,null,null,null,null,null,null,null,null,null,null,null,null,null,null,null,null,null,null,null,5850,0]
["0305007","Anticuerpos específicos y otros autoanticuerpos (anticuerpos antitiroídeos: anticuerpos antimicrosomales y antitiroglobulinas y otros anticuerpos: prostático, espermios, etc.) c/u",0,0,null,null,null,null,null,null,null,null,null,null,null,null,null,null,null,null,null,null,null,null,null,null,null,null,null,null,null,null,null,null,null,null,4720,0]
["0305008","Antiestreptolisina O, por técnica de látex ",0,0,null,null,null,null,null,null,null,null,null,null,null,null,null,null,null,null,null,null,null,null,null,null,null,null,null,null,null,null,null,null,null,null,3750,0]
["0305009","Antígeno carcinoembrionario (CEA)",0,0,null,null,null,null,null,null,null,null,null,null,null,null,null,null,null,null,null,null,null,null,null,null,null,null,null,null,null,null,null,null,null,null,5730,0]
["0305070","Antígeno prostático específico",0,0,null,null,null,null,null,null,null,null,null,null,null,null,null,null,null,null,null,null,null,null,null,null,null,null,null,null,null,null,null,null,null,null,7590,0]
["0305170","Antígeno Ca 125, Ca 15-3 y Ca 19-9, c/u",0,0,null,null,null,null,null,null,null,null,null,null,null,null,null,null,null,null,null,null,null,null,null,null,null,null,null,null,null,null,null,null,null,null,7590,0]
["0305010","Beta-2-microglobulina",0,0,null,null,null,null,null,null,null,null,null,null,null,null,null,null,null,null,null,null,null,null,null,null,null,null,null,null,null,null,null,null,null,null,5730,0]
["0305012","Complemento C1Q, C2, C3, C4, etc., c/u",0,0,null,null,null,null,null,null,null,null,null,null,null,null,null,null,null,null,null,null,null,null,null,null,null,null,null,null,null,null,null,null,null,null,3750,0]
["0305013","Complemento hemolítico (CH 50)",0,0,null,null,null,null,null,null,null,null,null,null,null,null,null,null,null,null,null,null,null,null,null,null,null,null,null,null,null,null,null,null,null,null,4720,0]
["0305014","Crioglobulinas, precipitación en frío (cualitativa) o cuantitativa c/u",0,0,null,null,null,null,null,null,null,null,null,null,null,null,null,null,null,null,null,null,null,null,null,null,null,null,null,null,null,null,null,null,null,null,910,0]
["0305015","Depósito de complejos inmunes por inmunofluorescencia",0,0,null,null,null,null,null,null,null,null,null,null,null,null,null,null,null,null,null,null,null,null,null,null,null,null,null,null,null,null,null,null,null,null,2170,0]
["0305019","Factor reumatoídeo por técnica de látex u otras similares",0,0,null,null,null,null,null,null,null,null,null,null,null,null,null,null,null,null,null,null,null,null,null,null,null,null,null,null,null,null,null,null,null,null,2170,0]
["0305020","Factor reumatoídeo por técnica Scat, Waaler Rose, nefelométricas y/o turbidimétricas",0,0,null,null,null,null,null,null,null,null,null,null,null,null,null,null,null,null,null,null,null,null,null,null,null,null,null,null,null,null,null,null,null,null,3870,0]
["0305021","Inhibidor de C1Q, C2 y C3, c/u",0,0,null,null,null,null,null,null,null,null,null,null,null,null,null,null,null,null,null,null,null,null,null,null,null,null,null,null,null,null,null,null,null,null,3750,0]
["0305025","Inmunofijación de inmunoglobulina, c/u",0,0,null,null,null,null,null,null,null,null,null,null,null,null,null,null,null,null,null,null,null,null,null,null,null,null,null,null,null,null,null,null,null,null,6510,0]
["0305026","Inmunoglobulina IgA secretora",0,0,null,null,null,null,null,null,null,null,null,null,null,null,null,null,null,null,null,null,null,null,null,null,null,null,null,null,null,null,null,null,null,null,3670,0]
["0305027","Inmunoglobulinas IgA, IgG, IgM, c/u",0,0,null,null,null,null,null,null,null,null,null,null,null,null,null,null,null,null,null,null,null,null,null,null,null,null,null,null,null,null,null,null,null,null,3750,0]
["0305028","Inmunoglobulinas IgE, IgD total, c/u",0,0,null,null,null,null,null,null,null,null,null,null,null,null,null,null,null,null,null,null,null,null,null,null,null,null,null,null,null,null,null,null,null,null,4300,0]
["0305029","Inmunoglobulinas IgE, IgG específicas, c/u",0,0,null,null,null,null,null,null,null,null,null,null,null,null,null,null,null,null,null,null,null,null,null,null,null,null,null,null,null,null,null,null,null,null,4300,0]
["0305030","Proteína C reactiva por técnica de látex u otras similares",0,0,null,null,null,null,null,null,null,null,null,null,null,null,null,null,null,null,null,null,null,null,null,null,null,null,null,null,null,null,null,null,null,null,3630,0]
["0305031","Proteina C reactiva por técnicas automatizadas",0,0,null,null,null,null,null,null,null,null,null,null,null,null,null,null,null,null,null,null,null,null,null,null,null,null,null,null,null,null,null,null,null,null,5010,0]
["0305034","Quimiotaxis-leucotaxis",{"$f":"SUM(D344+G344)","v":0},{"$f":"SUM(E344:F344)","v":0},null,null,null,null,null,null,null,null,null,null,null,null,null,null,null,null,null,null,null,null,null,null,null,null,null,null,null,null,null,null,null,null,5650,0]
["0305181","Anticuerpos antitransglutaminasa (TTG)",0,0,null,null,null,null,null,null,null,null,null,null,null,null,null,null,null,null,null,null,null,null,null,null,null,null,null,null,null,null,null,null,null,null,9290,0]
["0305035","Detección, identificación y titulación de crioaglutininas",0,0,null,null,null,null,null,null,null,null,null,null,null,null,null,null,null,null,null,null,null,null,null,null,null,null,null,null,null,null,null,null,null,null,1870,0]
["0305036","Criohemolisinas",0,0,null,null,null,null,null,null,null,null,null,null,null,null,null,null,null,null,null,null,null,null,null,null,null,null,null,null,null,null,null,null,null,null,1870,0]
["0305037","Digestión fagocítica nitroblue-tetrazolium cualitativo y cuantitativo",0,0,null,null,null,null,null,null,null,null,null,null,null,null,null,null,null,null,null,null,null,null,null,null,null,null,null,null,null,null,null,null,null,null,4800,0]
["0305038","Fagocitosis: ingestión y digestión (killing) de levaduras por polimorfonucleares",0,0,null,null,null,null,null,null,null,null,null,null,null,null,null,null,null,null,null,null,null,null,null,null,null,null,null,null,null,null,null,null,null,null,9850,0]
["0305039","Fagocitosis: ingestión y digestión (killing) de bacterias por polimorfonucleares",0,0,null,null,null,null,null,null,null,null,null,null,null,null,null,null,null,null,null,null,null,null,null,null,null,null,null,null,null,null,null,null,null,null,9850,0]
["0305040","Inmunoadherencia de leucocitos macrófagos",0,0,null,null,null,null,null,null,null,null,null,null,null,null,null,null,null,null,null,null,null,null,null,null,null,null,null,null,null,null,null,null,null,null,3860,{"$f":"AK351*E351","v":0}]
["0305041","Intradermoreacción (PPD, histoplasmina, aspergilina, u otros, incluye el valor del antígeno y reacción de control), c/u. ",0,0,null,null,null,null,null,null,null,null,null,null,null,null,null,null,null,null,null,null,null,null,null,null,null,null,null,null,null,null,null,null,null,null,3860,0]
["0305042","LIF o MIF",0,0,null,null,null,null,null,null,null,null,null,null,null,null,null,null,null,null,null,null,null,null,null,null,null,null,null,null,null,null,null,null,null,null,4800,0]
["0305044","Linfocitos B (rosetas EAC) y linfocitos T (rosetas E) c/u",0,0,null,null,null,null,null,null,null,null,null,null,null,null,null,null,null,null,null,null,null,null,null,null,null,null,null,null,null,null,null,null,null,null,4390,0]
["0305047","Linfotoxinas humanas, detección de",0,0,null,null,null,null,null,null,null,null,null,null,null,null,null,null,null,null,null,null,null,null,null,null,null,null,null,null,null,null,null,null,null,null,6630,0]
["0305049","Transformación linfoblástica a drogas, análisis de transformación espontanea con estimulo inespecífico y con diferentes concentraciones de la droga en 1000 células",0,0,null,null,null,null,null,null,null,null,null,null,null,null,null,null,null,null,null,null,null,null,null,null,null,null,null,null,null,null,null,null,null,null,19190,0]
["0305089","Linfocitos B totales (CD19). Técnica Citometría de Flujo",{"$f":"SUM(D357+G357)","v":0},{"$f":"SUM(E357:F357)","v":0},null,null,null,null,null,null,null,null,null,null,null,null,null,null,null,null,null,null,null,null,null,null,null,null,null,null,null,null,null,null,null,null,34950,0]
["0305051","Absorción de autoanticuerpos del receptor",0,0,null,null,null,null,null,null,null,null,null,null,null,null,null,null,null,null,null,null,null,null,null,null,null,null,null,null,null,null,null,null,null,null,5610,0]
["0305052","Anticuerpos linfocitotóxicos (PRA) por microlinfocitotoxicidad",0,0,null,null,null,null,null,null,null,null,null,null,null,null,null,null,null,null,null,null,null,null,null,null,null,null,null,null,null,null,null,null,null,null,6630,0]
["0305053","Autocrossmatch con linfocitos T y B",0,0,null,null,null,null,null,null,null,null,null,null,null,null,null,null,null,null,null,null,null,null,null,null,null,null,null,null,null,null,null,null,null,null,11730,0]
["0305054","Autocross match con linfocitos totales",0,0,null,null,null,null,null,null,null,null,null,null,null,null,null,null,null,null,null,null,null,null,null,null,null,null,null,null,null,null,null,null,null,null,9320,0]
["0305056","Alocrossmatch con linfocitos totales",0,0,null,null,null,null,null,null,null,null,null,null,null,null,null,null,null,null,null,null,null,null,null,null,null,null,null,null,null,null,null,null,null,null,7200,0]
["0305057","Alocrossmatch con linfocitos T y B",0,0,null,null,null,null,null,null,null,null,null,null,null,null,null,null,null,null,null,null,null,null,null,null,null,null,null,null,null,null,null,null,null,null,19190,0]
["0305058","Cultivo mixto de linfocitos",0,0,null,null,null,null,null,null,null,null,null,null,null,null,null,null,null,null,null,null,null,null,null,null,null,null,null,null,null,null,null,null,null,null,47930,0]
["0305059","Identificación de clase de inmunoglobulinas de auto o alo cross match positivo",0,0,null,null,null,null,null,null,null,null,null,null,null,null,null,null,null,null,null,null,null,null,null,null,null,null,null,null,null,null,null,null,null,null,19190,0]
["0305060","Tipificación HLA B-27",0,0,null,null,null,null,null,null,null,null,null,null,null,null,null,null,null,null,null,null,null,null,null,null,null,null,null,null,null,null,null,null,null,null,13310,0]
["0305061","Tipificación HLA B-8",0,0,null,null,null,null,null,null,null,null,null,null,null,null,null,null,null,null,null,null,null,null,null,null,null,null,null,null,null,null,null,null,null,null,13840,0]
["0305062","Tipificación HLA  - DR serológica",0,0,null,null,null,null,null,null,null,null,null,null,null,null,null,null,null,null,null,null,null,null,null,null,null,null,null,null,null,null,null,null,null,null,53230,0]
["0305063","Tipificación HLA - A, B serológica",0,0,null,null,null,null,null,null,null,null,null,null,null,null,null,null,null,null,null,null,null,null,null,null,null,null,null,null,null,null,null,null,null,null,66580,0]
["0305064","Seroteca y mantención en la base  a receptores cadáver                       ",0,0,null,null,null,null,null,null,null,null,null,null,null,null,null,null,null,null,null,null,null,null,null,null,null,null,null,null,null,null,null,null,null,null,15530,0]
["\"0305091","Linfocitos T (CD3, CD4, CD8). Técnica Citometría de Flujo       ",0,0,null,null,null,null,null,null,null,null,null,null,null,null,null,null,null,null,null,null,null,null,null,null,null,null,null,null,null,null,null,null,null,null,21050,0]
["\"0305092","Natural Killers (CD16, CD 56). Técnica Citometría de Flujo         ",0,0,null,null,null,null,null,null,null,null,null,null,null,null,null,null,null,null,null,null,null,null,null,null,null,null,null,null,null,null,null,null,null,null,21050,0]
[null,"TOTAL",{"$f":"SUM(C319:C370)","v":0},{"$f":"SUM(D319:D370)","v":0},{"$f":"SUM(E319:E370)","v":0},{"$f":"SUM(F319:F370)","v":0},{"$f":"SUM(G319:G370)","v":0},null,null,null,null,null,null,null,null,null,null,null,null,null,null,null,null,null,null,null,{"$f":"SUM(AA319:AA370)","v":0},0,0,0,0,0,0,0,0,0,{"$f":"SUM(AK319:AK372)","v":566980},{"$f":"SUM(AL319:AL372)","v":0}]
[null,"VI.- EXAMENES MICROBIOLOGICOS                                                             ",null,null,null,null,null,null,null,null,null,null,null,null,null,null,null,null,null,null,null,null,null,null,null,null,null,null,null,null,null,null,null,null,null,null,null,{"$f":"AK374*E374","v":0}]
[null,"A.-      BACTERIAS Y HONGOS"]
["0306001","Baciloscopía por método de concentración",0,0,null,null,null,null,null,null,null,null,null,null,null,null,null,null,null,null,null,null,null,null,null,null,null,null,null,null,null,null,null,null,null,null,2030,{"$f":"AK376*E376","v":0}]
["0306002","Baciloscopía Ziehl-Neelsen, c/u",0,0,null,null,null,null,null,null,null,null,null,null,null,null,null,null,null,null,null,null,null,null,null,null,null,null,null,null,null,null,null,null,null,null,1370,0]
["0306004","Examen directo al fresco, c/s tinción (incluye trichomonas)",0,0,null,null,null,null,null,null,null,null,null,null,null,null,null,null,null,null,null,null,null,null,null,null,null,null,null,null,null,null,null,null,null,null,1190,0]
["0306005","Tinción de Gram",0,0,null,null,null,null,null,null,null,null,null,null,null,null,null,null,null,null,null,null,null,null,null,null,null,null,null,null,null,null,null,null,null,null,540,0]
["0306006","Ultramicroscopía (incluye toma de muestras)",0,0,null,null,null,null,null,null,null,null,null,null,null,null,null,null,null,null,null,null,null,null,null,null,null,null,null,null,null,null,null,null,null,null,3580,0]
["0306007","Coprocultivo, c/u",0,0,null,null,null,null,null,null,null,null,null,null,null,null,null,null,null,null,null,null,null,null,null,null,null,null,null,null,null,null,null,null,null,null,3400,0]
["0306008","Corriente (excepto coprocultivo, hemocultivo y urocultivo) c/u",0,0,null,null,null,null,null,null,null,null,null,null,null,null,null,null,null,null,null,null,null,null,null,null,null,null,null,null,null,null,null,null,null,null,2850,0]
["0306011","Urocultivo, recuento de colonias y antibiograma (cualquier técnica) (incluye toma de orina aséptica y frasco recolector) (no incluye recolector pediátrico ni sonda)",0,0,null,null,null,null,null,null,null,null,null,null,null,null,null,null,null,null,null,null,null,null,null,null,null,null,null,null,null,null,null,null,null,null,3000,0]
["0306091","Hemocultivo aeróbico automatizado con antibiograma",0,0,null,null,null,null,null,null,null,null,null,null,null,null,null,null,null,null,null,null,null,null,null,null,null,null,null,null,null,null,null,null,null,null,13500,0]
["0306092","Hemocultivo anaeróbico automatizado con antibiograma",0,0,null,null,null,null,null,null,null,null,null,null,null,null,null,null,null,null,null,null,null,null,null,null,null,null,null,null,null,null,null,null,null,null,9010,0]
["0306093","Hemocultivo automatizado para micobacterias ",0,0,null,null,null,null,null,null,null,null,null,null,null,null,null,null,null,null,null,null,null,null,null,null,null,null,null,null,null,null,null,null,null,null,12500,0]
["0306012","Anaerobios (incluye cód. 03-06-008)",0,0,null,null,null,null,null,null,null,null,null,null,null,null,null,null,null,null,null,null,null,null,null,null,null,null,null,null,null,null,null,null,null,null,5300,0]
["0306013","Cultivo para Bordetella",0,0,null,null,null,null,null,null,null,null,null,null,null,null,null,null,null,null,null,null,null,null,null,null,null,null,null,null,null,null,null,null,null,null,5020,0]
["0306014","Cultivo para Campylobacter, Yersinia, Vibrio, c/u",0,0,null,null,null,null,null,null,null,null,null,null,null,null,null,null,null,null,null,null,null,null,null,null,null,null,null,null,null,null,null,null,null,null,3580,0]
["0306016","Neisseria gonorrhoeae (gonococo)",0,0,null,null,null,null,null,null,null,null,null,null,null,null,null,null,null,null,null,null,null,null,null,null,null,null,null,null,null,null,null,null,null,null,2410,0]
["0306017","Cultivo para Levaduras",0,0,null,null,null,null,null,null,null,null,null,null,null,null,null,null,null,null,null,null,null,null,null,null,null,null,null,null,null,null,null,null,null,null,2190,0]
["0306117","Hongos Filamentosos",0,0,null,null,null,null,null,null,null,null,null,null,null,null,null,null,null,null,null,null,null,null,null,null,null,null,null,null,null,null,null,null,null,null,2480,0]
["0306018","Cultivo para micobacterias (incluye bacilo de Koch)",0,0,null,null,null,null,null,null,null,null,null,null,null,null,null,null,null,null,null,null,null,null,null,null,null,null,null,null,null,null,null,null,null,null,3540,0]
["0306019","Cultivo para Legionella",0,0,null,null,null,null,null,null,null,null,null,null,null,null,null,null,null,null,null,null,null,null,null,null,null,null,null,null,null,null,null,null,null,null,3580,0]
["0306022","Cultivo y Tipificación de micobacterias",0,0,null,null,null,null,null,null,null,null,null,null,null,null,null,null,null,null,null,null,null,null,null,null,null,null,null,null,null,null,null,null,null,null,3580,0]
["0306023","Cultivo mycoplasma y ureaplasma, c/u.",0,0,null,null,null,null,null,null,null,null,null,null,null,null,null,null,null,null,null,null,null,null,null,null,null,null,null,null,null,null,null,null,null,null,5010,0]
["0306025","Bacilo de Koch (cada fármaco)",0,0,null,null,null,null,null,null,null,null,null,null,null,null,null,null,null,null,null,null,null,null,null,null,null,null,null,null,null,null,null,null,null,null,3580,0]
["0306026","Corriente (mínimo 10 fármacos) (en caso de urocultivo no corresponde su cobro; incluido en el valor 03-06-011)",0,0,null,null,null,null,null,null,null,null,null,null,null,null,null,null,null,null,null,null,null,null,null,null,null,null,null,null,null,null,null,null,null,null,2240,0]
["0306027","Estudio de sensibilidad por dilución (CIM) (mínimo 6 fármacos) (en caso de urocultivo, no corresponde su cobro; incluido en el valor código 03-06-011)",{"$f":"SUM(D399+G399)","v":0},{"$f":"SUM(E399:F399)","v":0},null,null,null,null,null,null,null,null,null,null,null,null,null,null,null,null,null,null,null,null,null,null,null,null,null,null,null,null,null,null,null,null,6280,0]
["0306028","Antifungigrama (mínimo 4 fármacos antihongos)",0,0,null,null,null,null,null,null,null,null,null,null,null,null,null,null,null,null,null,null,null,null,null,null,null,null,null,null,null,null,null,null,null,null,1720,0]
["0306033","Brucella abortus, melitensis y suis, anticuerpos, por Aglutinación o Elisa",0,0,null,null,null,null,null,null,null,null,null,null,null,null,null,null,null,null,null,null,null,null,null,null,null,null,null,null,null,null,null,null,null,null,1250,0]
["0306034","Clamidias por inmunofluorescencia, peroxidasa, Elisa o similares",0,0,null,null,null,null,null,null,null,null,null,null,null,null,null,null,null,null,null,null,null,null,null,null,null,null,null,null,null,null,null,null,null,null,4390,0]
["0306036","Mononucleosis, reacción de Paul Bunnell, Anticuerpos Heterófilos o similares",0,0,null,null,null,null,null,null,null,null,null,null,null,null,null,null,null,null,null,null,null,null,null,null,null,null,null,null,null,null,null,null,null,null,1910,0]
["0306037","Mycoplasma IgG, IgM, c/u. ",0,0,null,null,null,null,null,null,null,null,null,null,null,null,null,null,null,null,null,null,null,null,null,null,null,null,null,null,null,null,null,null,null,null,3860,0]
["0306038","R.P.R.",0,0,null,null,null,null,null,null,null,null,null,null,null,null,null,null,null,null,null,null,null,null,null,null,null,null,null,null,null,null,null,null,null,null,2140,0]
["0306039","Tíficas, reacciones de aglutinación  (Eberth H y O, paratyphi A y B) (Widal)",0,0,null,null,null,null,null,null,null,null,null,null,null,null,null,null,null,null,null,null,null,null,null,null,null,null,null,null,null,null,null,null,null,null,3010,0]
["0306041","Treponema pallidum FTA - ABS, MHA-TP c/u",0,0,null,null,null,null,null,null,null,null,null,null,null,null,null,null,null,null,null,null,null,null,null,null,null,null,null,null,null,null,null,null,null,null,3980,0]
["0306042","V.D.R.L.",0,0,null,null,null,null,null,null,null,null,null,null,null,null,null,null,null,null,null,null,null,null,null,null,null,null,null,null,null,null,null,null,null,null,2540,0]
["0306094","Antígeno galactomanano",0,0,null,null,null,null,null,null,null,null,null,null,null,null,null,null,null,null,null,null,null,null,null,null,null,null,null,null,null,null,null,null,null,null,17500,0]
[null,"TOTAL",{"$f":"SUM(C376:C409)","v":0},{"$f":"SUM(D376:D409)","v":0},{"$f":"SUM(E376:E409)","v":0},{"$f":"SUM(F376:F409)","v":0},{"$f":"SUM(G376:G409)","v":0},null,null,null,null,null,null,null,null,null,null,null,null,null,null,null,null,null,null,null,{"$f":"SUM(AA376:AA409)","v":0},0,0,0,0,0,0,0,0,0,144060,0]
[null,"B) PARASITOS                                                                                        "]
["0306043","Artrópodos macroscópicos y microscópicos (imagos y/o pupas y/o larvas), diagnóstico de",0,0,null,null,null,null,null,null,null,null,null,null,null,null,null,null,null,null,null,null,null,null,null,null,null,null,null,null,null,null,null,null,null,null,2410,{"$f":"AK412*E412","v":0}]
["0306045","Coproparasitario seriado con técnica  para Cryptosporidium sp o para Diantamoeba fragilis (incluye los códigos 03-06-048 y/o 03-06-059 más aplicación de técnica de frotis con tinción tricrómica o tinción Ziehl-Neelsen en por lo menos 3 muestras, según corresponda)",0,0,null,null,null,null,null,null,null,null,null,null,null,null,null,null,null,null,null,null,null,null,null,null,null,null,null,null,null,null,null,null,null,null,7200,0]
["0306046","Coproparasitario seriado para fasciola hepática (incluye diagnóstico de gusanos macroscópicos y examen microscópico de 10 muestras por método de Telemann y simultaneamente por técnica de Sedimentación rápida (Copa Cónica).",0,0,null,null,null,null,null,null,null,null,null,null,null,null,null,null,null,null,null,null,null,null,null,null,null,null,null,null,null,null,null,null,null,null,14390,0]
["0306047","Coproparasitario seriado para Isospora y Sarcocystis (incluye diagnóstico de gusanos macroscópicos y examen  microscópico de 3 muestras separadas)",0,0,null,null,null,null,null,null,null,null,null,null,null,null,null,null,null,null,null,null,null,null,null,null,null,null,null,null,null,null,null,null,null,null,3860,0]
["0306048","Coproparasitológico seriado simple (incluye diagnostico de gusanos macroscópicos y examen microscópico por concentración de 3 muestras separadas método Telemann) (proc. aut.)",0,0,null,null,null,null,null,null,null,null,null,null,null,null,null,null,null,null,null,null,null,null,null,null,null,null,null,null,null,null,null,null,null,null,2540,0]
["0306049","Diagnostico de parásitos en jugo duodenal y/o bilis, examen macroscópico y microscópico (directo y/o concentración, c/s tinción)",0,0,null,null,null,null,null,null,null,null,null,null,null,null,null,null,null,null,null,null,null,null,null,null,null,null,null,null,null,null,null,null,null,null,2410,0]
["0306050","Diagnostico parasitario en exudados, secreciones y otros líquidos orgánicos (no especificados mas adelante), examen macro y microscópico de (incluye concentración y/o tinción cuando proceda), c/u",0,0,null,null,null,null,null,null,null,null,null,null,null,null,null,null,null,null,null,null,null,null,null,null,null,null,null,null,null,null,null,null,null,null,2410,0]
["0306051","Graham, examen de (incluye diagnostico de gusanos macroscópicos y examen microscópico de 5 muestras separadas)",0,0,null,null,null,null,null,null,null,null,null,null,null,null,null,null,null,null,null,null,null,null,null,null,null,null,null,null,null,null,null,null,null,null,1720,0]
["0306052","Estudio de gusanos macroscópicos",0,0,null,null,null,null,null,null,null,null,null,null,null,null,null,null,null,null,null,null,null,null,null,null,null,null,null,null,null,null,null,null,null,null,1370,0]
["0306053","Hemoparásitos, diagnóstico microscópico de (mínimo 10 frotis y/o gotas gruesas, c/s examen directo al fresco), cada sesión",0,0,null,null,null,null,null,null,null,null,null,null,null,null,null,null,null,null,null,null,null,null,null,null,null,null,null,null,null,null,null,null,null,null,7200,0]
["0306054","Hemoparasitos, diagnóstico por técnica de Microstrout o similar en hasta 10 tubos capilares, cada sesión (Chagas)",0,0,null,null,null,null,null,null,null,null,null,null,null,null,null,null,null,null,null,null,null,null,null,null,null,null,null,null,null,null,null,null,null,null,9540,0]
["0306056","Raspado de piel, examen microscópico de (\"Acarotest\"): de 6 a 10 preparaciones",0,0,null,null,null,null,null,null,null,null,null,null,null,null,null,null,null,null,null,null,null,null,null,null,null,null,null,null,null,null,null,null,null,null,3250,0]
["0306057","Tenias post. trat., Diagnostico y búsqueda de escólex de",0,0]
["0306058","Xenodiagnóstico (cada aplicación de 2 cajas, con 6 ninfas por lo menos c/u, examinadas a los 20 y/o 30 días y hasta por 60 días más si procede)",0,0]
["0306059","Coproparasitológico seriado simple (incluye diagnóstico de gusanos macroscopicos  y exámen microscopico por concentración de tres muestras separadas método PAFS (proc. aut.)",0,0,null,null,null,null,null,null,null,null,null,null,null,null,null,null,null,null,null,null,null,null,null,null,null,null,null,null,null,null,null,null,null,null,3280,{"$f":"AK426*E426","v":0}]
["0306061","Parásitos IgG/IgM (Chagas, Hidatidosis, Toxocariasis y otros por Elisa o Inmunofluorescencia), c/u",0,0,null,null,null,null,null,null,null,null,null,null,null,null,null,null,null,null,null,null,null,null,null,null,null,null,null,null,null,null,null,null,null,null,4390,{"$f":"AK427*E427","v":0}]
["0306066","Inmunofluorescencia indirecta (toxoplasmosis, Chagas, amebiasis y otras), c/u",0,0,null,null,null,null,null,null,null,null,null,null,null,null,null,null,null,null,null,null,null,null,null,null,null,null,null,null,null,null,null,null,null,null,4390,{"$f":"AK428*E428","v":0}]
["0306095","Parásitos: determinación por reacción de polimerasa en cadena (PCR)",0,0,null,null,null,null,null,null,null,null,null,null,null,null,null,null,null,null,null,null,null,null,null,null,null,null,null,null,null,null,null,null,null,null,31960,{"$f":"AK429*E429","v":0}]
["0306096","Parásitos: test rápido anticuerpos (Chagas y otros)",0,0,null,null,null,null,null,null,null,null,null,null,null,null,null,null,null,null,null,null,null,null,null,null,null,null,null,null,null,null,null,null,null,null,8740,{"$f":"AK430*E430","v":0}]
[null,"TOTAL",{"$f":"SUM(C412:C430)","v":0},{"$f":"SUM(D412:D430)","v":0},{"$f":"SUM(E412:E430)","v":0},{"$f":"SUM(F412:F430)","v":0},{"$f":"SUM(G412:G430)","v":0},null,null,null,null,null,null,null,null,null,null,null,null,null,null,null,null,null,null,null,{"$f":"SUM(AA412:AA430)","v":0},0,0,0,0,0,0,0,0,0,{"$f":"SUM(AK412:AK430)","v":111060},{"$f":"SUM(AL412:AL430)","v":0}]
[null,"C) VIRUS                                                                                                                       "]
["0306068","Aislamiento de virus (Adenovirus, Citomegalovirus, Enterovirus, Herpes, Influenza, Polio,Sarampion y otros), c/u",0,0,null,null,null,null,null,null,null,null,null,null,null,null,null,null,null,null,null,null,null,null,null,null,null,null,null,null,null,null,null,null,null,null,5300,{"$f":"AK433*E433","v":0}]
["0306069","Anticuerpos virales, determ. de (adenovirus, citomegalovirus, herpes simple, rubéola, Influenza  A y B; virus varicela-zoster; virus sincicial respiratorio; parainfluenza 1, 2 y 3, Epstein Barr y otros), c/u",0,0,null,null,null,null,null,null,null,null,null,null,null,null,null,null,null,null,null,null,null,null,null,null,null,null,null,null,null,null,null,null,null,null,4550,0]
["0306169","Anticuerpos virales, determ. de H.I.V.",0,0,null,null,null,null,null,null,null,null,null,null,null,null,null,null,null,null,null,null,null,null,null,null,null,null,null,null,null,null,null,null,null,null,4520,0]
["0306070","Antígenos virales determ. de (adenovirus, citomegalovirus, herpes simple, rubéola, influenza y otros), (por cualquier técnica ej: inmunofluorescencia), c/u",0,0,null,null,null,null,null,null,null,null,null,null,null,null,null,null,null,null,null,null,null,null,null,null,null,null,null,null,null,null,null,null,null,null,4240,0]
["0306170","Antígenos virales determ. de rotavirus, por cualquier técnica ",0,0,null,null,null,null,null,null,null,null,null,null,null,null,null,null,null,null,null,null,null,null,null,null,null,null,null,null,null,null,null,null,null,null,4240,0]
["0306270","Antígenos virales determ. de virus sincicial, por cualquier técnica ",0,0,null,null,null,null,null,null,null,null,null,null,null,null,null,null,null,null,null,null,null,null,null,null,null,null,null,null,null,null,null,null,null,null,4670,0]
["0306072","Reacción de seroneutralización para: virus polio, ECHO, Coxsakie, c/u",0,0]
["0306073","Virus hepatitis A, Anticore",0,0]
["0306074","Virus Hepatitis A, anticuerpos IgG, IgM o totales c/u",0,0,null,null,null,null,null,null,null,null,null,null,null,null,null,null,null,null,null,null,null,null,null,null,null,null,null,null,null,null,null,null,null,null,6300,{"$f":"AK441*E441","v":0}]
["0306075","Virus hepatitis B, anticuerpo del antígeno E del",0,0,null,null,null,null,null,null,null,null,null,null,null,null,null,null,null,null,null,null,null,null,null,null,null,null,null,null,null,null,null,null,null,null,5300,0]
["0306076","Virus hepatitis B, anticore total del (anti HBc total)",0,0,null,null,null,null,null,null,null,null,null,null,null,null,null,null,null,null,null,null,null,null,null,null,null,null,null,null,null,null,null,null,null,null,5810,0]
["0306077","Virus hepatitis B, anticuerpos contra antígeno superficie",0,0,null,null,null,null,null,null,null,null,null,null,null,null,null,null,null,null,null,null,null,null,null,null,null,null,null,null,null,null,null,null,null,null,4340,0]
["0306078","Virus hepatitis B, antígeno E del (HBEAg)",0,0,null,null,null,null,null,null,null,null,null,null,null,null,null,null,null,null,null,null,null,null,null,null,null,null,null,null,null,null,null,null,null,null,5300,0]
["0306079","Virus hepatitis B, antigeno de superficie (HBsAg)",0,0,null,null,null,null,null,null,null,null,null,null,null,null,null,null,null,null,null,null,null,null,null,null,null,null,null,null,null,null,null,null,null,null,4390,0]
["0306080","Virus hepatitis B, anticore IgM del (anti HBc IgM)",0,0,null,null,null,null,null,null,null,null,null,null,null,null,null,null,null,null,null,null,null,null,null,null,null,null,null,null,null,null,null,null,null,null,6000,0]
["0306081","Virus hepatitis C, anticuerpos de (anti HCV)",0,0,null,null,null,null,null,null,null,null,null,null,null,null,null,null,null,null,null,null,null,null,null,null,null,null,null,null,null,null,null,null,null,null,6660,0]
["0306082","Reacción de Polimerasa en cadena (P.C.R.), virus Influenza, virus Herpes, citomegalovirus, hepatitis C, mycobacteria TBC, c/u (incluye toma muestra hisopado nasofaríngeo).",0,0,null,null,null,null,null,null,null,null,null,null,null,null,null,null,null,null,null,null,null,null,null,null,null,null,null,null,null,null,null,null,null,null,25170,0]
[null,"TOTAL",{"$f":"SUM(C433:C449)","v":0},{"$f":"SUM(D433:D449)","v":0},{"$f":"SUM(E433:E449)","v":0},{"$f":"SUM(F433:F449)","v":0},{"$f":"SUM(G433:G449)","v":0},null,null,null,null,null,null,null,null,null,null,null,null,null,null,null,null,null,null,null,{"$f":"SUM(AA433:AA449)","v":0},0,0,0,0,0,0,0,0,0,96790,0]
["VII. PROCEDIMIENTOS O DETERMINACIONES DIRECTAMENTE CON EL PACIENTE             "]
["0307001","Dietilendiamina tetraacetato de sodio cromo (EDTA Cr 51)",0,0,null,null,null,null,null,null,null,null,null,null,null,null,null,null,null,null,null,null,null,null,null,null,null,null,null,null,null,null,null,null,null,null,4800,{"$f":"AK452*E452","v":0}]
["0307002","Prueba de la sed (volumen, densidad, osmolalidad seriada en sangre y orina)",{"$f":"SUM(D453+G453)","v":0},{"$f":"SUM(E453:F453)","v":0},null,null,null,null,null,null,null,null,null,null,null,null,null,null,null,null,null,null,null,null,null,null,null,null,null,null,null,null,null,null,null,null,4270,0]
["0307005","Reacción cutánea de parche c/u",0,0,null,null,null,null,null,null,null,null,null,null,null,null,null,null,null,null,null,null,null,null,null,null,null,null,null,null,null,null,null,null,null,null,540,0]
["0307006","Sobrecarga hídrica",0,0,null,null,null,null,null,null,null,null,null,null,null,null,null,null,null,null,null,null,null,null,null,null,null,null,null,null,null,null,null,null,null,null,1190,0]
["0307007","Test del sudor (procedimiento completo)",0,0,null,null,null,null,null,null,null,null,null,null,null,null,null,null,null,null,null,null,null,null,null,null,null,null,null,null,null,null,null,null,null,null,11290,0]
["0307008","Vasopresina test o similares (incluye, además, mediciones de diuresis)",0,0,null,null,null,null,null,null,null,null,null,null,null,null,null,null,null,null,null,null,null,null,null,null,null,null,null,null,null,null,null,null,null,null,3610,0]
["0307023","Aspirados nasofaríngeo para adulto y niño.",0,0,null,null,null,null,null,null,null,null,null,null,null,null,null,null,null,null,null,null,null,null,null,null,null,null,null,null,null,null,null,null,null,null,1880,0]
["0307024","Reacción cutánea a alergenos  (incluye el valor de los alergenos)",0,0,null,null,null,null,null,null,null,null,null,null,null,null,null,null,null,null,null,null,null,null,null,null,null,null,null,null,null,null,null,null,null,null,4800,0]
[null,"TOTAL",{"$f":"SUM(C452:C459)","v":0},{"$f":"SUM(D452:D459)","v":0},{"$f":"SUM(E452:E459)","v":0},{"$f":"SUM(F452:F459)","v":0},{"$f":"SUM(G452:G459)","v":0},null,null,null,null,null,null,null,null,null,null,null,null,null,null,null,null,null,null,null,{"$f":"SUM(AA452:AA459)","v":0},0,0,0,0,0,0,0,0,0,32380,0]
[null,"Toma de muestras "]
["0307009","Toma de muestra arterial en adultos",0,0]
["0307010","Toma de muestra arterial en niños y lactantes",0,0]
["0307011","Toma de muestra venosa en adultos",0,0]
["0307012","Toma de muestra venosa en niños y lactantes",0,0]
["0307013","Toma de muestra con técnica aséptica para hemocultivo, c/u",0,0]
["0307014","Toma de muestra capilar ( adultos, niños y lactantes )",0,0]
["0307016","Toma de muestra por punción traqueal",0,0]
["0307017","Toma de muestra por punción vesical en recién nacidos",0,0]
["0307018","Toma de muestra por punción medular ósea",0,0]
["0307023","Aspirados nasofaríngeo para adulto y niño.",0,0]
[null,"TOTAL",{"$f":"SUM(C462:C471)","v":0},{"$f":"SUM(D462:D471)","v":0},{"$f":"SUM(E462:E471)","v":0},{"$f":"SUM(F462:F471)","v":0},{"$f":"SUM(G462:G471)","v":0},null,null,null,null,null,null,null,null,null,null,null,null,null,null,null,null,null,null,null,{"$f":"SUM(AA462:AA471)","v":0},0,0,0,0,0,0,0,0,0]
[null,"VIII. EXAMENES DE DEPOSICIONES, EXUDADOS, SECRECIONES Y OTROS LIQUIDOS        "]
["0308001","Azúcares reductores (Benedict-Fehling o similar)",0,0,null,null,null,null,null,null,null,null,null,null,null,null,null,null,null,null,null,null,null,null,null,null,null,null,null,null,null,null,null,null,null,null,940,{"$f":"AK474*E474","v":0}]
["0308003","Grasas neutras (Sudán III)",0,0,null,null,null,null,null,null,null,null,null,null,null,null,null,null,null,null,null,null,null,null,null,null,null,null,null,null,null,null,null,null,null,null,540,0]
["0308004","Hemorragias ocultas, (bencidina, guayaco o test de Weber y similares), cualquier método, c/muestra",0,0,null,null,null,null,null,null,null,null,null,null,null,null,null,null,null,null,null,null,null,null,null,null,null,null,null,null,null,null,null,null,null,null,940,0]
["0308005","Leucocitos fecales",0,0,null,null,null,null,null,null,null,null,null,null,null,null,null,null,null,null,null,null,null,null,null,null,null,null,null,null,null,null,null,null,null,null,940,0]
["0308006","PH",0,0,null,null,null,null,null,null,null,null,null,null,null,null,null,null,null,null,null,null,null,null,null,null,null,null,null,null,null,null,null,null,null,null,540,0]
["0308009","Células neoplásicas en fluídos biológicos",0,0,null,null,null,null,null,null,null,null,null,null,null,null,null,null,null,null,null,null,null,null,null,null,null,null,null,null,null,null,null,null,null,null,3360,0]
["0308010","Citológico c/s tinción (incluye examen al fresco, recuento celular y citológico porcentual)",0,0,null,null,null,null,null,null,null,null,null,null,null,null,null,null,null,null,null,null,null,null,null,null,null,null,null,null,null,null,null,null,null,null,2420,0]
["0308011","Directo al fresco c/s tinción, (incluye trichomonas)",0,0,null,null,null,null,null,null,null,null,null,null,null,null,null,null,null,null,null,null,null,null,null,null,null,null,null,null,null,null,null,null,null,null,1190,0]
["0308012","Electrolitos (sodio, potasio, cloro), en exudados, secreciones y otros líquidos, c/u ",0,0,null,null,null,null,null,null,null,null,null,null,null,null,null,null,null,null,null,null,null,null,null,null,null,null,null,null,null,null,null,null,null,null,1190,0]
["0308013","Eosinófilos en secreciones",0,0,null,null,null,null,null,null,null,null,null,null,null,null,null,null,null,null,null,null,null,null,null,null,null,null,null,null,null,null,null,null,null,null,660,0]
["0308014","Físico-químico (incluye aspecto, color, pH, glucosa, proteína, Pandy y filancia)",0,0,null,null,null,null,null,null,null,null,null,null,null,null,null,null,null,null,null,null,null,null,null,null,null,null,null,null,null,null,null,null,null,null,1880,0]
["0308015","Glucosa en exudados, secreciones y otros líquidos",0,0,null,null,null,null,null,null,null,null,null,null,null,null,null,null,null,null,null,null,null,null,null,null,null,null,null,null,null,null,null,null,null,null,540,0]
["0308016","Mucina, determinación de",0,0,null,null,null,null,null,null,null,null,null,null,null,null,null,null,null,null,null,null,null,null,null,null,null,null,null,null,null,null,null,null,null,null,940,0]
["0308017","pH en exudados, secreciones y otros líquidos (proc. aut.)",0,0,null,null,null,null,null,null,null,null,null,null,null,null,null,null,null,null,null,null,null,null,null,null,null,null,null,null,null,null,null,null,null,null,540,0]
["0308018","Proteínas totales o albúmina (proc. aut.) c/u",0,0,null,null,null,null,null,null,null,null,null,null,null,null,null,null,null,null,null,null,null,null,null,null,null,null,null,null,null,null,null,null,null,null,1190,0]
["0308019","Proteinas, electroforésis de (incluye proteínas totales) en otros líquidos biológicos",0,0,null,null,null,null,null,null,null,null,null,null,null,null,null,null,null,null,null,null,null,null,null,null,null,null,null,null,null,null,null,null,null,null,5030,0]
["0308020","Bandas oligoclonales (incluye electroforesis de L.C.R., suero e inmunofijación)",0,0,null,null,null,null,null,null,null,null,null,null,null,null,null,null,null,null,null,null,null,null,null,null,null,null,null,null,null,null,null,null,null,null,17290,0]
["0308021","Glutamina",0,0,null,null,null,null,null,null,null,null,null,null,null,null,null,null,null,null,null,null,null,null,null,null,null,null,null,null,null,null,null,null,null,null,1590,0]
["0308022","Indice IgG/albúmina (incluye determ. de IgG y albúmina en L.C.R. y suero)",0,0,null,null,null,null,null,null,null,null,null,null,null,null,null,null,null,null,null,null,null,null,null,null,null,null,null,null,null,null,null,null,null,null,9550,0]
["0308023","Estudio de cristales (con luz polarizada)",0,0,null,null,null,null,null,null,null,null,null,null,null,null,null,null,null,null,null,null,null,null,null,null,null,null,null,null,null,null,null,null,null,null,1190,0]
["0308025","Prueba de estimulación máxima con histamina, mínimo 5 muestras (no incluye la histamina ni el antihistamínico).",0,0,null,null,null,null,null,null,null,null,null,null,null,null,null,null,null,null,null,null,null,null,null,null,null,null,null,null,null,null,null,null,null,null,4800,0]
["0308029","Espermiograma (físico y microscópico, con o sin observación hasta 24 horas)",0,0,null,null,null,null,null,null,null,null,null,null,null,null,null,null,null,null,null,null,null,null,null,null,null,null,null,null,null,null,null,null,null,null,3300,0]
["0308030","Fosfatasa ácida prostática",0,0,null,null,null,null,null,null,null,null,null,null,null,null,null,null,null,null,null,null,null,null,null,null,null,null,null,null,null,null,null,null,null,null,2420,0]
["0308031","Fructosa seminal",0,0,null,null,null,null,null,null,null,null,null,null,null,null,null,null,null,null,null,null,null,null,null,null,null,null,null,null,null,null,null,null,null,null,1380,0]
["0308033","Células anaranjadas (proc. aut.)",0,0,null,null,null,null,null,null,null,null,null,null,null,null,null,null,null,null,null,null,null,null,null,null,null,null,null,null,null,null,null,null,null,null,540,0]
["0308034","Contaminantes (meconio y sangre) (proc. aut.)",0,0,null,null,null,null,null,null,null,null,null,null,null,null,null,null,null,null,null,null,null,null,null,null,null,null,null,null,null,null,null,null,null,null,940,0]
["0308035","Creatinina en exudados, secreciones y otros líquidos (proc. aut.)",0,0,null,null,null,null,null,null,null,null,null,null,null,null,null,null,null,null,null,null,null,null,null,null,null,null,null,null,null,null,null,null,null,null,940,0]
["0308036","Fosfatidil glicerol y/o fosfatidil inositol",0,0,null,null,null,null,null,null,null,null,null,null,null,null,null,null,null,null,null,null,null,null,null,null,null,null,null,null,null,null,null,null,null,null,5300,0]
["0308037","Indice de bilirrubina (prueba de Liley)",0,0,null,null,null,null,null,null,null,null,null,null,null,null,null,null,null,null,null,null,null,null,null,null,null,null,null,null,null,null,null,null,null,null,1190,0]
["0308038","Indice lecitina/esfingomielina",0,0,null,null,null,null,null,null,null,null,null,null,null,null,null,null,null,null,null,null,null,null,null,null,null,null,null,null,null,null,null,null,null,null,4800,0]
["0308039","Madurez fetal completa (físico; células anaranjadas, bilirrubina, test de Clements, creatinina, contaminantes)",0,0,null,null,null,null,null,null,null,null,null,null,null,null,null,null,null,null,null,null,null,null,null,null,null,null,null,null,null,null,null,null,null,null,4800,0]
["0308040","Test de Clements (proc. aut.)",{"$f":"SUM(D505+G505)","v":0},{"$f":"SUM(E505:F505)","v":0},null,null,null,null,null,null,null,null,null,null,null,null,null,null,null,null,null,null,null,null,null,null,null,null,null,null,null,null,null,null,null,null,940,0]
["0308041","Colpocitograma",0,0,null,null,null,null,null,null,null,null,null,null,null,null,null,null,null,null,null,null,null,null,null,null,null,null,null,null,null,null,null,null,null,null,1880,0]
["0308043","Moco-semen, prueba de compatibilidad",0,0,null,null,null,null,null,null,null,null,null,null,null,null,null,null,null,null,null,null,null,null,null,null,null,null,null,null,null,null,null,null,null,null,1880,0]
["0308044","Flujo vaginal o secreción uretral, estudio de (incluye toma de muestra y códigos 03-06-004, 03-06-005, 03-06-008, 03-06-017, y 03-06-026 )",0,0,null,null,null,null,null,null,null,null,null,null,null,null,null,null,null,null,null,null,null,null,null,null,null,null,null,null,null,null,null,null,null,null,6580,0]
["0308045","Amilasa en Líquidos Biológicos",0,0,null,null,null,null,null,null,null,null,null,null,null,null,null,null,null,null,null,null,null,null,null,null,null,null,null,null,null,null,null,null,null,null,3440,0]
["0308046","Lipasa en Líquidos Biológicos",0,0,null,null,null,null,null,null,null,null,null,null,null,null,null,null,null,null,null,null,null,null,null,null,null,null,null,null,null,null,null,null,null,null,2260,0]
[null,"TOTAL",{"$f":"SUM(C474:C510)","v":0},{"$f":"SUM(D474:D510)","v":0},{"$f":"SUM(E474:E510)","v":0},{"$f":"SUM(F474:F510)","v":0},{"$f":"SUM(G474:G510)","v":0},null,null,null,null,null,null,null,null,null,null,null,null,null,null,null,null,null,null,null,{"$f":"SUM(AA474:AA510)","v":0},0,0,0,0,0,0,0,0,0,99850,0]
[null,"IX. EXAMENES ORINA         "]
["0309001","Acido ascórbico",0,0,null,null,null,null,null,null,null,null,null,null,null,null,null,null,null,null,null,null,null,null,null,null,null,null,null,null,null,null,null,null,null,null,1880,{"$f":"AK513*E513","v":0}]
["0309002","Acido delta aminolevulínico",0,0,null,null,null,null,null,null,null,null,null,null,null,null,null,null,null,null,null,null,null,null,null,null,null,null,null,null,null,null,null,null,null,null,3860,0]
["0309004","Ácido úrico en orina (cuantitativo)",0,0,null,null,null,null,null,null,null,null,null,null,null,null,null,null,null,null,null,null,null,null,null,null,null,null,null,null,null,null,null,null,null,null,1720,0]
["0309005","Acido 5 hidroxiindolacético cuantitativo",0,0,null,null,null,null,null,null,null,null,null,null,null,null,null,null,null,null,null,null,null,null,null,null,null,null,null,null,null,null,null,null,null,null,4020,0]
["0309006","Amilasa cuantitativa en orina",0,0,null,null,null,null,null,null,null,null,null,null,null,null,null,null,null,null,null,null,null,null,null,null,null,null,null,null,null,null,null,null,null,null,2120,0]
["0309007","Aminoácidos (cualitativo) (excepto fenilalanina, PKU)",0,0,null,null,null,null,null,null,null,null,null,null,null,null,null,null,null,null,null,null,null,null,null,null,null,null,null,null,null,null,null,null,null,null,3860,0]
["0309008","Calcio cuantitativo en orina",0,0,null,null,null,null,null,null,null,null,null,null,null,null,null,null,null,null,null,null,null,null,null,null,null,null,null,null,null,null,null,null,null,null,1590,0]
["0309009","Cálculo urinario (examen físico y químico)",0,0,null,null,null,null,null,null,null,null,null,null,null,null,null,null,null,null,null,null,null,null,null,null,null,null,null,null,null,null,null,null,null,null,3320,0]
["0309010","Creatinina cuantitativa en orina",0,0,null,null,null,null,null,null,null,null,null,null,null,null,null,null,null,null,null,null,null,null,null,null,null,null,null,null,null,null,null,null,null,null,1190,0]
["0309011","Cuerpos cetónicos",0,0,null,null,null,null,null,null,null,null,null,null,null,null,null,null,null,null,null,null,null,null,null,null,null,null,null,null,null,null,null,null,null,null,1190,0]
["0309012","Electrolitos (sodio, potasio, cloro) c/u, en orina",0,0,null,null,null,null,null,null,null,null,null,null,null,null,null,null,null,null,null,null,null,null,null,null,null,null,null,null,null,null,null,null,null,null,1190,0]
["0309013","Microalbuminuria cuantitativa",0,0,null,null,null,null,null,null,null,null,null,null,null,null,null,null,null,null,null,null,null,null,null,null,null,null,null,null,null,null,null,null,null,null,2410,0]
["0309014","Gonadotrofina coriónica, sub-unidad beta en orina (test rápido)",0,0,null,null,null,null,null,null,null,null,null,null,null,null,null,null,null,null,null,null,null,null,null,null,null,null,null,null,null,null,null,null,null,null,2030,0]
["0309015","Fósforo cuantitativo en orina",0,0,null,null,null,null,null,null,null,null,null,null,null,null,null,null,null,null,null,null,null,null,null,null,null,null,null,null,null,null,null,null,null,null,1590,0]
["0309016","Glucosa (cuantitativo), en orina",0,0,null,null,null,null,null,null,null,null,null,null,null,null,null,null,null,null,null,null,null,null,null,null,null,null,null,null,null,null,null,null,null,null,1060,0]
["0309035","Hemosiderina",0,0,null,null,null,null,null,null,null,null,null,null,null,null,null,null,null,null,null,null,null,null,null,null,null,null,null,null,null,null,null,null,null,null,900,0]
["0309017","Hidroxiprolina en orina",0,0,null,null,null,null,null,null,null,null,null,null,null,null,null,null,null,null,null,null,null,null,null,null,null,null,null,null,null,null,null,null,null,null,3610,0]
["0309019","Mucopolisacáridos",0,0,null,null,null,null,null,null,null,null,null,null,null,null,null,null,null,null,null,null,null,null,null,null,null,null,null,null,null,null,null,null,null,null,4800,0]
["0309020","Nitrógeno ureico o urea en orina (cuantitativo)",0,0,null,null,null,null,null,null,null,null,null,null,null,null,null,null,null,null,null,null,null,null,null,null,null,null,null,null,null,null,null,null,null,null,660,0]
["0309021","Nucleótidos cíclicos (CAMP, CGM, u otros) c/u",0,0,null,null,null,null,null,null,null,null,null,null,null,null,null,null,null,null,null,null,null,null,null,null,null,null,null,null,null,null,null,null,null,null,3860,0]
["0309022","Orina completa, (incluye cód. 03-09-023 y 03-09-024)",0,0,null,null,null,null,null,null,null,null,null,null,null,null,null,null,null,null,null,null,null,null,null,null,null,null,null,null,null,null,null,null,null,null,1530,0]
["0309023","Orina, físico-químico (aspecto, color, densidad, pH; proteinas, glucosa, cuerpos cetónicos, urobilinogeno, bilirrubina, hemoglobina y nitritos, determinación cualitativa o semi cuantitativa) todos o cada uno de los parámetros (proc. aut.)",0,0,null,null,null,null,null,null,null,null,null,null,null,null,null,null,null,null,null,null,null,null,null,null,null,null,null,null,null,null,null,null,null,null,940,0]
["0309024","Sedimento de orina (proc. aut.)",0,0,null,null,null,null,null,null,null,null,null,null,null,null,null,null,null,null,null,null,null,null,null,null,null,null,null,null,null,null,null,null,null,null,870,0]
["0309025","Osmolalidad",0,0,null,null,null,null,null,null,null,null,null,null,null,null,null,null,null,null,null,null,null,null,null,null,null,null,null,null,null,null,null,null,null,null,1380,0]
["0309027","Porfirinas, c/u",0,0,null,null,null,null,null,null,null,null,null,null,null,null,null,null,null,null,null,null,null,null,null,null,null,null,null,null,null,null,null,null,null,null,1660,0]
["0309028","Proteína (cuantitativa), en orina",0,0,null,null,null,null,null,null,null,null,null,null,null,null,null,null,null,null,null,null,null,null,null,null,null,null,null,null,null,null,null,null,null,null,1380,0]
["0309029","Proteínas de Bence-Jones prueba térmica",0,0,null,null,null,null,null,null,null,null,null,null,null,null,null,null,null,null,null,null,null,null,null,null,null,null,null,null,null,null,null,null,null,null,940,0]
["0309031","Screening de drogas                                    ",0,0,null,null,null,null,null,null,null,null,null,null,null,null,null,null,null,null,null,null,null,null,null,null,null,null,null,null,null,null,null,null,null,null,5340,0]
[null,"TOTAL",{"$f":"SUM(C513:C540)","v":0},{"$f":"SUM(D513:D540)","v":0},{"$f":"SUM(E513:E540)","v":0},{"$f":"SUM(F513:F540)","v":0},{"$f":"SUM(G513:G540)","v":0},null,null,null,null,null,null,null,null,null,null,null,null,null,null,null,null,null,null,null,{"$f":"SUM(AA513:AA540)","v":0},0,0,0,0,0,0,0,0,0,60900,0]
[null,"GRUPO 04 : IMAGENOLOGIA                "]
[null,"A.EXAMENES RADIOLOGICOS SIMPLES      "]
["0401001","Radiografía de las glándulas salivales \"sialografía\"",0,0,null,null,null,null,null,null,null,null,null,null,null,null,null,null,null,null,null,null,null,null,null,null,null,null,null,null,null,null,null,null,null,null,18310,{"$f":"AK544*E544","v":0}]
["0401002","Radiografía de partes blandas, laringe lateral, cavum rinofaríngeo (rinofarinx). ",0,0,null,null,null,null,null,null,null,null,null,null,null,null,null,null,null,null,null,null,null,null,null,null,null,null,null,null,null,null,null,null,null,null,7670,0]
["0401004","Radiografía de tórax, proyección complementaria (oblicuas, selectivas u otras)",0,0,null,null,null,null,null,null,null,null,null,null,null,null,null,null,null,null,null,null,null,null,null,null,null,null,null,null,null,null,null,null,null,null,5530,0]
["0401006","Estudio radiológico de corazón (incluye fluoroscopía, telerradiografías frontal y lateral con esofagograma) ",0,0,null,null,null,null,null,null,null,null,null,null,null,null,null,null,null,null,null,null,null,null,null,null,null,null,null,null,null,null,null,null,null,null,16510,0]
["0401008","Radiografía de tórax  frontal o lateral con equipo móvil fuera del departamento de rayos.",0,0,null,null,null,null,null,null,null,null,null,null,null,null,null,null,null,null,null,null,null,null,null,null,null,null,null,null,null,null,null,null,null,null,8210,0]
["0401009","Radiografía de tórax simple frontal o lateral ",0,0,null,null,null,null,null,null,null,null,null,null,null,null,null,null,null,null,null,null,null,null,null,null,null,null,null,null,null,null,null,null,null,null,8210,0]
["0401070","Radiografía de tórax frontal y lateral",0,0,null,null,null,null,null,null,null,null,null,null,null,null,null,null,null,null,null,null,null,null,null,null,null,null,null,null,null,null,null,null,null,null,15040,0]
["0401010","Mamografía bilateral",0,0,null,null,null,null,null,null,null,null,null,null,null,null,null,null,null,null,null,null,null,null,null,null,null,null,null,null,null,null,null,null,null,null,17410,0]
["0401110","Mamografía unilateral",0,0,null,null,null,null,null,null,null,null,null,null,null,null,null,null,null,null,null,null,null,null,null,null,null,null,null,null,null,null,null,null,null,null,10380,0]
["0401130","Mamografía proyección complementaria  (axilar u otras)",0,0,null,null,null,null,null,null,null,null,null,null,null,null,null,null,null,null,null,null,null,null,null,null,null,null,null,null,null,null,null,null,null,null,3980,0]
["0401011","Marcación preoperatoria de lesiones de la mama",0,0,null,null,null,null,null,null,null,null,null,null,null,null,null,null,null,null,null,null,null,null,null,null,null,null,null,null,null,null,null,null,null,null,18310,0]
["0401012","Radiografía de mama, pieza operatoria",0,0,null,null,null,null,null,null,null,null,null,null,null,null,null,null,null,null,null,null,null,null,null,null,null,null,null,null,null,null,null,null,null,null,5530,0]
["0401013","Radiografía de Abdomen Simple",0,0,null,null,null,null,null,null,null,null,null,null,null,null,null,null,null,null,null,null,null,null,null,null,null,null,null,null,null,null,null,null,null,null,7300,0]
["0401014","Radiografía de abdomen simple, proyección complementaria (lateral y/o oblicua)",0,0,null,null,null,null,null,null,null,null,null,null,null,null,null,null,null,null,null,null,null,null,null,null,null,null,null,null,null,null,null,null,null,null,5530,0]
["0401015","Colangiografía intra o postoperatoria (por sonda T, o similar)",0,0,null,null,null,null,null,null,null,null,null,null,null,null,null,null,null,null,null,null,null,null,null,null,null,null,null,null,null,null,null,null,null,null,15270,0]
["0401018","Enema baritado del colon (incluye llene y control post-vaciamiento)",0,0,null,null,null,null,null,null,null,null,null,null,null,null,null,null,null,null,null,null,null,null,null,null,null,null,null,null,null,null,null,null,null,null,30790,0]
["0401019","Enema baritado del colon o intestino delgado, doble contraste",{"$f":"SUM(D560+G560)","v":0},{"$f":"SUM(E560:F560)","v":0},null,null,null,null,null,null,null,null,null,null,null,null,null,null,null,null,null,null,null,null,null,null,null,null,null,null,null,null,null,null,null,null,34630,0]
["0401020","Esofagograma  (incluye pesquisa de cuerpo extraño) (proc.aut.)",0,0,null,null,null,null,null,null,null,null,null,null,null,null,null,null,null,null,null,null,null,null,null,null,null,null,null,null,null,null,null,null,null,null,13700,0]
["0401021","Radiografía de esófago, estómago y duodeno, relleno y/o doble contraste ",0,0,null,null,null,null,null,null,null,null,null,null,null,null,null,null,null,null,null,null,null,null,null,null,null,null,null,null,null,null,null,null,null,null,30510,0]
["0401022","Estudio radiológico de deglución faríngea",0,0,null,null,null,null,null,null,null,null,null,null,null,null,null,null,null,null,null,null,null,null,null,null,null,null,null,null,null,null,null,null,null,null,13700,0]
["0401023","Estudio radiológico del intestino delgado",0,0,null,null,null,null,null,null,null,null,null,null,null,null,null,null,null,null,null,null,null,null,null,null,null,null,null,null,null,null,null,null,null,null,24430,0]
["0401024","Radiografía de esófago, estómago y duodeno, simple en niños ",0,0,null,null,null,null,null,null,null,null,null,null,null,null,null,null,null,null,null,null,null,null,null,null,null,null,null,null,null,null,null,null,null,null,22580,0]
["0401027","Pielografía de eliminación o descendente: incluye renal y vesical simples previas, 3 placas post inyección de medio de contraste, controles de pie y cistografía pre y post miccional. ",0,0,null,null,null,null,null,null,null,null,null,null,null,null,null,null,null,null,null,null,null,null,null,null,null,null,null,null,null,null,null,null,null,null,33240,0]
["0401028","Radiografía renal simple (proc. aut.)",0,0,null,null,null,null,null,null,null,null,null,null,null,null,null,null,null,null,null,null,null,null,null,null,null,null,null,null,null,null,null,null,null,null,7030,0]
["0401029","Radiografía vesical simple o perivesical (proc. aut.)",0,0,null,null,null,null,null,null,null,null,null,null,null,null,null,null,null,null,null,null,null,null,null,null,null,null,null,null,null,null,null,null,null,null,6110,0]
["0401030","Radiografía agujeros ópticos, ambos lados",0,0,null,null,null,null,null,null,null,null,null,null,null,null,null,null,null,null,null,null,null,null,null,null,null,null,null,null,null,null,null,null,null,null,12150,0]
["0401031","Radiografía de cavidades perinasales, órbitas, articulaciones temporomandibulares, huesos propios de la nariz, malar, maxilar, arco cigomático y cara",0,0,null,null,null,null,null,null,null,null,null,null,null,null,null,null,null,null,null,null,null,null,null,null,null,null,null,null,null,null,null,null,null,null,8210,0]
["0401032","Radiografía de cráneo frontal y lateral",0,0,null,null,null,null,null,null,null,null,null,null,null,null,null,null,null,null,null,null,null,null,null,null,null,null,null,null,null,null,null,null,null,null,8680,0]
["0401033","Radiografía de Cráneo  proyección especial de  base de cráneo (Towne)",0,0,null,null,null,null,null,null,null,null,null,null,null,null,null,null,null,null,null,null,null,null,null,null,null,null,null,null,null,null,null,null,null,null,6110,0]
["0401034","Radiografía de globo ocular, estudio de cuerpo extraño",0,0,null,null,null,null,null,null,null,null,null,null,null,null,null,null,null,null,null,null,null,null,null,null,null,null,null,null,null,null,null,null,null,null,15270,0]
["0401035","Radiografía de oído, uno o ambos",0,0,null,null,null,null,null,null,null,null,null,null,null,null,null,null,null,null,null,null,null,null,null,null,null,null,null,null,null,null,null,null,null,null,11990,0]
["0401040","Radiografía de silla turca frontal y lateral",0,0,null,null,null,null,null,null,null,null,null,null,null,null,null,null,null,null,null,null,null,null,null,null,null,null,null,null,null,null,null,null,null,null,10040,0]
["0401042","Radiografía de columna cervical o atlas-axis (frontal y lateral)",0,0,null,null,null,null,null,null,null,null,null,null,null,null,null,null,null,null,null,null,null,null,null,null,null,null,null,null,null,null,null,null,null,null,8210,{"$f":"AK576*E576","v":0}]
["0401043","Radiografía de columna cervical (frontal, lateral y oblicuas)",0,0,null,null,null,null,null,null,null,null,null,null,null,null,null,null,null,null,null,null,null,null,null,null,null,null,null,null,null,null,null,null,null,null,14640,0]
["0401044","Radiografía de columna cervical  flexión y  extensión (Dinámicas)",0,0,null,null,null,null,null,null,null,null,null,null,null,null,null,null,null,null,null,null,null,null,null,null,null,null,null,null,null,null,null,null,null,null,8210,0]
["0401045","Radiografía de columna dorsal o dorsolumbar localizada, parrilla costal adultos (frontal y lateral).",0,0,null,null,null,null,null,null,null,null,null,null,null,null,null,null,null,null,null,null,null,null,null,null,null,null,null,null,null,null,null,null,null,null,9610,0]
["0401046","Radiografía columna lumbar o lumbosacra ( frontal, lateral y focalizada en el 5° espacio)   ",0,0,null,null,null,null,null,null,null,null,null,null,null,null,null,null,null,null,null,null,null,null,null,null,null,null,null,null,null,null,null,null,null,null,14150,0]
["0401047","Radiografía columna lumbar o lumbosacra  flexión y  extensión (Dinámicas)",0,0,null,null,null,null,null,null,null,null,null,null,null,null,null,null,null,null,null,null,null,null,null,null,null,null,null,null,null,null,null,null,null,null,12150,0]
["0401048","Radiografía columna lumbar o lumbosacra, oblicuas adicionales ",0,0,null,null,null,null,null,null,null,null,null,null,null,null,null,null,null,null,null,null,null,null,null,null,null,null,null,null,null,null,null,null,null,null,8210,0]
["0401049","Radiografía de columna total, panorámica con folio graduado  frontal o lateral",0,0,null,null,null,null,null,null,null,null,null,null,null,null,null,null,null,null,null,null,null,null,null,null,null,null,null,null,null,null,null,null,null,null,10990,0]
["0401051","Radiografía de pelvis, cadera o coxofemoral",0,0,null,null,null,null,null,null,null,null,null,null,null,null,null,null,null,null,null,null,null,null,null,null,null,null,null,null,null,null,null,null,null,null,6340,0]
["0401151","Radiografía de pelvis, cadera o coxofemoral de RN, lactante o niño menor de 6 años.",0,0,null,null,null,null,null,null,null,null,null,null,null,null,null,null,null,null,null,null,null,null,null,null,null,null,null,null,null,null,null,null,null,null,6340,0]
["0401052","Radiografía de pelvis, cadera o coxofemoral, proyecciones especiales; (rotación interna, abducción, lateral, Lawenstein u otras)",0,0,null,null,null,null,null,null,null,null,null,null,null,null,null,null,null,null,null,null,null,null,null,null,null,null,null,null,null,null,null,null,null,null,6110,0]
["0401053","Radiografía de Sacrocoxis o articulaciones sacroilíacas.",0,0,null,null,null,null,null,null,null,null,null,null,null,null,null,null,null,null,null,null,null,null,null,null,null,null,null,null,null,null,null,null,null,null,9130,0]
["0401054","Radiografía de brazo, antebrazo, codo, muñeca, mano, dedos, pie  (frontal y lateral)",0,0,null,null,null,null,null,null,null,null,null,null,null,null,null,null,null,null,null,null,null,null,null,null,null,null,null,null,null,null,null,null,null,null,7300,0]
["0401055","Radiografía de clavícula.",0,0,null,null,null,null,null,null,null,null,null,null,null,null,null,null,null,null,null,null,null,null,null,null,null,null,null,null,null,null,null,null,null,null,8440,0]
["0401056","Radiografía Edad Ósea: carpo y mano ",0,0,null,null,null,null,null,null,null,null,null,null,null,null,null,null,null,null,null,null,null,null,null,null,null,null,null,null,null,null,null,null,null,null,7300,0]
["0401057","Radiografía Edad ósea : rodilla frontal",0,0,null,null,null,null,null,null,null,null,null,null,null,null,null,null,null,null,null,null,null,null,null,null,null,null,null,null,null,null,null,null,null,null,8440,0]
["0401058","Estudio radiológico de escafoides",0,0,null,null,null,null,null,null,null,null,null,null,null,null,null,null,null,null,null,null,null,null,null,null,null,null,null,null,null,null,null,null,null,null,9130,0]
["0401059","Estudio radiológico de muñeca o tobillo frontal lateral y oblicuas",0,0,null,null,null,null,null,null,null,null,null,null,null,null,null,null,null,null,null,null,null,null,null,null,null,null,null,null,null,null,null,null,null,null,8530,0]
["0401060","Radiografía de hombro, fémur, rodilla, pierna, costilla o esternón Frontal y Lateral",0,0,null,null,null,null,null,null,null,null,null,null,null,null,null,null,null,null,null,null,null,null,null,null,null,null,null,null,null,null,null,null,null,null,8530,0]
["0401062","Radiografía de Proyecciones especiales oblicuas u otras en hombro, brazo, codo, rodilla, rótulas, sesamoideos, axial de ambas rótulas o similares",0,0,null,null,null,null,null,null,null,null,null,null,null,null,null,null,null,null,null,null,null,null,null,null,null,null,null,null,null,null,null,null,null,null,6110,0]
["0401063","Radiografía de túnel intercondíleo o radio-carpiano",0,0,null,null,null,null,null,null,null,null,null,null,null,null,null,null,null,null,null,null,null,null,null,null,null,null,null,null,null,null,null,null,null,null,6110,0]
["0401064","Apoyo fluoroscópico a procedimientos intraoperatorios y/o biopsia (no incluye el proc.)",0,0,null,null,null,null,null,null,null,null,null,null,null,null,null,null,null,null,null,null,null,null,null,null,null,null,null,null,null,null,null,null,null,null,6110,0]
[5099115,"Radiografía de pelvis, cadera o coxofemoral de 1er screening  (entre 3 -6 meses)",{"$f":"SUM(D598+G598)","v":0},{"$f":"SUM(E598:F598)","v":0}]
[null,"TOTAL",{"$f":"SUM(C544:C597)","v":0},{"$f":"SUM(D544:D597)","v":0},{"$f":"SUM(E544:E597)","v":0},{"$f":"SUM(F544:F597)","v":0},{"$f":"SUM(G544:G597)","v":0},null,null,null,null,null,null,null,null,null,null,null,null,null,null,null,null,null,null,null,{"$f":"SUM(AA544:AA597)","v":0},0,0,0,0,0,0,0,0,0,{"$f":"SUM(AK544:AK597)","v":642450},{"$f":"SUM(AL544:AL597)","v":0}]
[null,"B.EXAMENES RADIOLOGICOS COMPLEJOS   "]
["0402001","Vía lagrimal (un lado) (2 exp.)",0,0,null,null,null,null,null,null,null,null,null,null,null,null,null,null,null,null,null,null,null,null,null,null,null,null,null,null,null,null,null,null,null,null,15250,{"$f":"AK601*E601","v":0}]
["0402005","Galactografía, unilateral",0,0,null,null,null,null,null,null,null,null,null,null,null,null,null,null,null,null,null,null,null,null,null,null,null,null,null,null,null,null,null,null,null,null,8760,0]
["0402008","Colangiopancreatografía endoscópica (5-7 exp)",0,0,null,null,null,null,null,null,null,null,null,null,null,null,null,null,null,null,null,null,null,null,null,null,null,null,null,null,null,null,null,null,null,null,67050,0]
["0402009","Fistulografía  (3 exp.)",0,0,null,null,null,null,null,null,null,null,null,null,null,null,null,null,null,null,null,null,null,null,null,null,null,null,null,null,null,null,null,null,null,null,12020,0]
["0402011","Histerosalpingografía (a.c. 20-01-013) (4 exp.; incluye prueba de Cotte tardía)",0,0,null,null,null,null,null,null,null,null,null,null,null,null,null,null,null,null,null,null,null,null,null,null,null,null,null,null,null,null,null,null,null,null,17860,0]
["0402012","Pielografía ascendente (3 exp.)",0,0,null,null,null,null,null,null,null,null,null,null,null,null,null,null,null,null,null,null,null,null,null,null,null,null,null,null,null,null,null,null,null,null,50170,0]
["0402014","Uretro y/o cistouretrografía miccional retrógrada  (5 exp.)",0,0,null,null,null,null,null,null,null,null,null,null,null,null,null,null,null,null,null,null,null,null,null,null,null,null,null,null,null,null,null,null,null,null,25650,0]
["0402015","Artrografía facetaria",0,0,null,null,null,null,null,null,null,null,null,null,null,null,null,null,null,null,null,null,null,null,null,null,null,null,null,null,null,null,null,null,null,null,29270,0]
["0402019","Angiografía selectiva de carótida externa o interna",0,0,null,null,null,null,null,null,null,null,null,null,null,null,null,null,null,null,null,null,null,null,null,null,null,null,null,null,null,null,null,null,null,null,50600,0]
["0402020","Angiografía selectiva medular",0,0,null,null,null,null,null,null,null,null,null,null,null,null,null,null,null,null,null,null,null,null,null,null,null,null,null,null,null,null,null,null,null,null,50600,0]
["0402024","Aortografía con AOT o cineangiografía",0,0,null,null,null,null,null,null,null,null,null,null,null,null,null,null,null,null,null,null,null,null,null,null,null,null,null,null,null,null,null,null,null,null,53850,0]
["0402025","Arteriografía de cada extremidad",0,0,null,null,null,null,null,null,null,null,null,null,null,null,null,null,null,null,null,null,null,null,null,null,null,null,null,null,null,null,null,null,null,null,40130,0]
["0402027","Arteriografía selectiva con AOT o cineangiografía (pulmonar, renal, tronco celíaco o similar) c/u",0,0,null,null,null,null,null,null,null,null,null,null,null,null,null,null,null,null,null,null,null,null,null,null,null,null,null,null,null,null,null,null,null,null,65900,0]
["0402029","Carótida vertebral por cateterización (de la subclavia axilar, humeral o femoral)",0,0,null,null,null,null,null,null,null,null,null,null,null,null,null,null,null,null,null,null,null,null,null,null,null,null,null,null,null,null,null,null,null,null,47500,0]
["0402031","Embolización o balonización (a.c. de la angiografía correspondiente) (incluye control radiológico inmediato)",0,0,null,null,null,null,null,null,null,null,null,null,null,null,null,null,null,null,null,null,null,null,null,null,null,null,null,null,null,null,null,null,null,null,19580,0]
["0402032","Instalación de catéter o sonda intracardíaca, control por radiólogo",0,0,null,null,null,null,null,null,null,null,null,null,null,null,null,null,null,null,null,null,null,null,null,null,null,null,null,null,null,null,null,null,null,null,48320,0]
["0402035","Cavografía",{"$f":"SUM(D617+G617)","v":0},{"$f":"SUM(E617:F617)","v":0},null,null,null,null,null,null,null,null,null,null,null,null,null,null,null,null,null,null,null,null,null,null,null,null,null,null,null,null,null,null,null,null,34290,0]
["0402038","Flebografía extremidad inferior o superior, un lado cada extremidad.",0,0,null,null,null,null,null,null,null,null,null,null,null,null,null,null,null,null,null,null,null,null,null,null,null,null,null,null,null,null,null,null,null,null,25820,0]
["0402040","Flebografía orbitaria o yugular",0,0,null,null,null,null,null,null,null,null,null,null,null,null,null,null,null,null,null,null,null,null,null,null,null,null,null,null,null,null,null,null,null,null,36290,0]
["0402041","Flebografía selectiva (suprarrenal y similares)",0,0,null,null,null,null,null,null,null,null,null,null,null,null,null,null,null,null,null,null,null,null,null,null,null,null,null,null,null,null,null,null,null,null,34290,0]
["0402050","Mielografía por punción lumbar con contraste hidrosoluble",0,0,null,null,null,null,null,null,null,null,null,null,null,null,null,null,null,null,null,null,null,null,null,null,null,null,null,null,null,null,null,null,null,null,36290,0]
[null,"TOTAL",{"$f":"SUM(C601:C621)","v":0},{"$f":"SUM(D601:D621)","v":0},{"$f":"SUM(E601:E621)","v":0},{"$f":"SUM(F601:F621)","v":0},{"$f":"SUM(G601:G621)","v":0},null,null,null,null,null,null,null,null,null,null,null,null,null,null,null,null,null,null,null,{"$f":"SUM(AA601:AA621)","v":0},0,0,0,0,0,0,0,0,0,769490,0]
[null,"II.TOMOGRAFIA AXIAL COMPUTARIZADA (TAC)   "]
["0403001","Tomografía Computarizada de cráneo encefálica",0,0,null,null,null,null,null,null,null,null,null,null,null,null,null,null,null,null,null,null,null,null,null,null,null,null,null,null,null,null,null,null,null,null,51710,{"$f":"AK624*E624","v":0}]
["0403002","Tomografía Computarizada de hipotálamo-hipófisis",0,0,null,null,null,null,null,null,null,null,null,null,null,null,null,null,null,null,null,null,null,null,null,null,null,null,null,null,null,null,null,null,null,null,57700,0]
["0403003","Tomografía Computarizada de fosa posterior",0,0,null,null,null,null,null,null,null,null,null,null,null,null,null,null,null,null,null,null,null,null,null,null,null,null,null,null,null,null,null,null,null,null,47570,0]
["0403006","Tomografía Computarizada de temporal-oído ",0,0,null,null,null,null,null,null,null,null,null,null,null,null,null,null,null,null,null,null,null,null,null,null,null,null,null,null,null,null,null,null,null,null,47570,0]
["0403007","Tomografía Computarizada de órbitas maxilofacial ",0,0,null,null,null,null,null,null,null,null,null,null,null,null,null,null,null,null,null,null,null,null,null,null,null,null,null,null,null,null,null,null,null,null,57700,0]
["0403008","Tomografía Computarizada de columna cervical ",0,0,null,null,null,null,null,null,null,null,null,null,null,null,null,null,null,null,null,null,null,null,null,null,null,null,null,null,null,null,null,null,null,null,63110,0]
["0403018","Tomografía Computarizada de Columna Dorsal. Incluye mínimo 6 espacios",{"$f":"SUM(D630+G630)","v":0},{"$f":"SUM(E630:F630)","v":0},null,null,null,null,null,null,null,null,null,null,null,null,null,null,null,null,null,null,null,null,null,null,null,null,null,null,null,null,null,null,null,null,57610,0]
["0403019","Tomografía Computarizada de Columna Lumbar ",0,0,null,null,null,null,null,null,null,null,null,null,null,null,null,null,null,null,null,null,null,null,null,null,null,null,null,null,null,null,null,null,null,null,57610,0]
["0403012","Tomografía Computarizada de cuello, partes blandas ",0,0,null,null,null,null,null,null,null,null,null,null,null,null,null,null,null,null,null,null,null,null,null,null,null,null,null,null,null,null,null,null,null,null,47570,0]
["0403013","Tomografía Computarizada de Tórax. Incluye además: Esternón, Clavículas,Articulación Acromioclavicular, Escápula, Costillas, Articulación Esternoclavicular. Incluye todo el Tórax o cada segmento o articulación.Incluye bilateralidad",0,0,null,null,null,null,null,null,null,null,null,null,null,null,null,null,null,null,null,null,null,null,null,null,null,null,null,null,null,null,null,null,null,null,74500,0]
["0403014","Tomografía Computarizada de abdomen (hígado, vías y vesícula biliar, páncreas, bazo, suprarrenales y riñones)",0,0,null,null,null,null,null,null,null,null,null,null,null,null,null,null,null,null,null,null,null,null,null,null,null,null,null,null,null,null,null,null,null,null,44370,0]
["0403020","Tomografía Computarizada de Abdomen y Pelvis",0,0,null,null,null,null,null,null,null,null,null,null,null,null,null,null,null,null,null,null,null,null,null,null,null,null,null,null,null,null,null,null,null,null,75430,0]
["0403021","Tomografía Computarizada Pielografía",0,0,null,null,null,null,null,null,null,null,null,null,null,null,null,null,null,null,null,null,null,null,null,null,null,null,null,null,null,null,null,null,null,null,17520,0]
["0403022","Tomografía Computarizada Urografía",0,0,null,null,null,null,null,null,null,null,null,null,null,null,null,null,null,null,null,null,null,null,null,null,null,null,null,null,null,null,null,null,null,null,43810,0]
["0403023","Tomografía Computarizada de Colonoscopía Virtual. No incluye instalación de sonda",0,0,null,null,null,null,null,null,null,null,null,null,null,null,null,null,null,null,null,null,null,null,null,null,null,null,null,null,null,null,null,null,null,null,33410,0]
["0403024","Tomografía Computarizada Planificación Radioterapia",0,0,null,null,null,null,null,null,null,null,null,null,null,null,null,null,null,null,null,null,null,null,null,null,null,null,null,null,null,null,null,null,null,null,47460,0]
["0403025","Tomografía Computarizada de Calcio Coronario",0,0,null,null,null,null,null,null,null,null,null,null,null,null,null,null,null,null,null,null,null,null,null,null,null,null,null,null,null,null,null,null,null,null,20280,0]
["0403104","Tomografia Computarizada Angio de Cuello",0,0,null,null,null,null,null,null,null,null,null,null,null,null,null,null,null,null,null,null,null,null,null,null,null,null,null,null,null,null,null,null,null,null,42400,0]
["0403105","Tomografía Computarizada Angio de Pelvis",0,0,null,null,null,null,null,null,null,null,null,null,null,null,null,null,null,null,null,null,null,null,null,null,null,null,null,null,null,null,null,null,null,null,34610,0]
["0403106","Tomografía Computarizada de Angio Cardíaco. Mínimo 64 cortes",0,0,null,null,null,null,null,null,null,null,null,null,null,null,null,null,null,null,null,null,null,null,null,null,null,null,null,null,null,null,null,null,null,null,38060,0]
["0403016","Tomografía Computarizada de Pelvis (Además incluye Sacro, Coxis, Caderas, Huesos Pélvicos, Articulaciones Sacro Ilíacas). Bilateral",0,0,null,null,null,null,null,null,null,null,null,null,null,null,null,null,null,null,null,null,null,null,null,null,null,null,null,null,null,null,null,null,null,null,44370,0]
["0403017","Tomografía Computarizada Musculoesquelética por zona anatómica. Por cada segmento o articulación: muslo, pierna, rodillas, antebrazo, codo, muñeca, mano, hombro, pie, tobillo u otros. Bilateral sólo para rodillas",0,0,null,null,null,null,null,null,null,null,null,null,null,null,null,null,null,null,null,null,null,null,null,null,null,null,null,null,null,null,null,null,null,null,40250,0]
["0403101","Tomografía Computarizada angio  de encéfalo",0,0,null,null,null,null,null,null,null,null,null,null,null,null,null,null,null,null,null,null,null,null,null,null,null,null,null,null,null,null,null,null,null,null,62730,0]
["0403102","Tomografía Computarizada angio de tórax",0,0,null,null,null,null,null,null,null,null,null,null,null,null,null,null,null,null,null,null,null,null,null,null,null,null,null,null,null,null,null,null,null,null,89230,0]
["0403103","Tomografía Computarizada angio de abdomen",0,0,null,null,null,null,null,null,null,null,null,null,null,null,null,null,null,null,null,null,null,null,null,null,null,null,null,null,null,null,null,null,null,null,84940,0]
[null,"TOTAL",{"$f":"SUM(C624:C648)","v":0},{"$f":"SUM(D624:D648)","v":0},{"$f":"SUM(E624:E648)","v":0},{"$f":"SUM(F624:F648)","v":0},{"$f":"SUM(G624:G648)","v":0},null,null,null,null,null,null,null,null,null,null,null,null,null,null,null,null,null,null,null,{"$f":"SUM(AA624:AA648)","v":0},0,0,0,0,0,0,0,0,0,1281520,0]
[null,"III.ULTRASONOGRAFIA                "]
["0404002","Ecografía obstétrica",0,0,null,null,null,null,null,null,null,null,null,null,null,null,null,null,null,null,null,null,null,null,null,null,null,null,null,null,null,null,null,null,null,null,5600,{"$f":"AK651*E651","v":0}]
["0404003","Ecografía abdominal (incluye hígado, vía biliar, vesícula, páncreas, riñones, bazo, retroperitoneo y grandes vasos)",0,0,null,null,null,null,null,null,null,null,null,null,null,null,null,null,null,null,null,null,null,null,null,null,null,null,null,null,null,null,null,null,null,null,20520,0]
["0404004","Ecografía como apoyo a cirugía, o a procedimiento (de tórax, muscular, partes blandas, etc.)",0,0,null,null,null,null,null,null,null,null,null,null,null,null,null,null,null,null,null,null,null,null,null,null,null,null,null,null,null,null,null,null,null,null,12680,0]
["0404005","Ecografía transvaginal o transrectal",0,0,null,null,null,null,null,null,null,null,null,null,null,null,null,null,null,null,null,null,null,null,null,null,null,null,null,null,null,null,null,null,null,null,11410,0]
["0404006","Ecografía ginecológica, pelviana femenina u obstétrica con estudio fetal",0,0,null,null,null,null,null,null,null,null,null,null,null,null,null,null,null,null,null,null,null,null,null,null,null,null,null,null,null,null,null,null,null,null,10870,0]
["0404007","Ecografía transvaginal para seguimiento de ovulación, procedimiento completo (6-8 sesiones )",0,0,null,null,null,null,null,null,null,null,null,null,null,null,null,null,null,null,null,null,null,null,null,null,null,null,null,null,null,null,null,null,null,null,15850,0]
["0404008","Ecografía para seguimiento de ovulación, procedimiento completo (6 a 8 sesiones)",0,0,null,null,null,null,null,null,null,null,null,null,null,null,null,null,null,null,null,null,null,null,null,null,null,null,null,null,null,null,null,null,null,null,15850,0]
["0404009","Ecografía pélvica masculina (incluye vejiga y próstata)",0,0,null,null,null,null,null,null,null,null,null,null,null,null,null,null,null,null,null,null,null,null,null,null,null,null,null,null,null,null,null,null,null,null,11410,0]
["0404010","Ecografía renal (bilateral), o de bazo",0,0,null,null,null,null,null,null,null,null,null,null,null,null,null,null,null,null,null,null,null,null,null,null,null,null,null,null,null,null,null,null,null,null,14270,0]
["0404011","Ecografía encefálica (RN o lactante)",0,0,null,null,null,null,null,null,null,null,null,null,null,null,null,null,null,null,null,null,null,null,null,null,null,null,null,null,null,null,null,null,null,null,14270,0]
["0404012","Ecografía mamaria bilateral (incluye Doppler)",0,0,null,null,null,null,null,null,null,null,null,null,null,null,null,null,null,null,null,null,null,null,null,null,null,null,null,null,null,null,null,null,null,null,14270,0]
["0404013","Ecografía ocular, uno o ambos ojos.",0,0,null,null,null,null,null,null,null,null,null,null,null,null,null,null,null,null,null,null,null,null,null,null,null,null,null,null,null,null,null,null,null,null,14270,0]
["0404014","Ecografía testicular (uno o ambos) (Incluye Doppler)",0,0,null,null,null,null,null,null,null,null,null,null,null,null,null,null,null,null,null,null,null,null,null,null,null,null,null,null,null,null,null,null,null,null,14270,0]
["0404015","Ecografía tiroidea (Incluye Doppler)",0,0,null,null,null,null,null,null,null,null,null,null,null,null,null,null,null,null,null,null,null,null,null,null,null,null,null,null,null,null,null,null,null,null,14270,0]
["0404016","Ecografía Partes Blandas o Musculoesquelética (cada zona anatómica)",0,0,null,null,null,null,null,null,null,null,null,null,null,null,null,null,null,null,null,null,null,null,null,null,null,null,null,null,null,null,null,null,null,null,14270,0]
["0404118","Ecografía vascular (arterial y venosa) periférica (bilateral)",0,0,null,null,null,null,null,null,null,null,null,null,null,null,null,null,null,null,null,null,null,null,null,null,null,null,null,null,null,null,null,null,null,null,48730,0]
["0404119","Ecografía doppler de vasos del cuello",0,0,null,null,null,null,null,null,null,null,null,null,null,null,null,null,null,null,null,null,null,null,null,null,null,null,null,null,null,null,null,null,null,null,48730,0]
["0404120","Ecografía transcraneana",0,0,null,null,null,null,null,null,null,null,null,null,null,null,null,null,null,null,null,null,null,null,null,null,null,null,null,null,null,null,null,null,null,null,48730,0]
["0404121","Ecografía abdominal o de vasos testiculares",0,0,null,null,null,null,null,null,null,null,null,null,null,null,null,null,null,null,null,null,null,null,null,null,null,null,null,null,null,null,null,null,null,null,48730,0]
["0404122","Ecografía doppler de vasos placentarios",0,0,null,null,null,null,null,null,null,null,null,null,null,null,null,null,null,null,null,null,null,null,null,null,null,null,null,null,null,null,null,null,null,null,48730,0]
[null,"TOTAL",{"$f":"SUM(C651:C670)","v":0},{"$f":"SUM(D651:D670)","v":0},0,0,0,null,null,null,null,null,null,null,null,null,null,null,null,null,null,null,null,null,null,null,0,0,0,0,0,0,0,0,0,0,447730,0]
[null,"IV.- RESONANCIA MAGNÉTICA (incluye medio de contraste)     "]
["0405001","Resonancia Magnética Cráneo Encefálica u Oídos, bilateral",0,0,null,null,null,null,null,null,null,null,null,null,null,null,null,null,null,null,null,null,null,null,null,null,null,null,null,null,null,null,null,null,null,null,165910,{"$f":"AK673*E673","v":0}]
["0405002","Resonancia Magnética de hipotálamo - hipófisis",0,0,null,null,null,null,null,null,null,null,null,null,null,null,null,null,null,null,null,null,null,null,null,null,null,null,null,null,null,null,null,null,null,null,165910,0]
["0405003","Resonancia Magnética  de órbitas",0,0,null,null,null,null,null,null,null,null,null,null,null,null,null,null,null,null,null,null,null,null,null,null,null,null,null,null,null,null,null,null,null,null,157360,0]
["0405004","Resonancia Magnética de articulaciones temporomandibulares",0,0,null,null,null,null,null,null,null,null,null,null,null,null,null,null,null,null,null,null,null,null,null,null,null,null,null,null,null,null,null,null,null,null,157360,0]
["0405005","Resonancia Magnética  de columna cervical",0,0,null,null,null,null,null,null,null,null,null,null,null,null,null,null,null,null,null,null,null,null,null,null,null,null,null,null,null,null,null,null,null,null,165910,0]
["0405006","Resonancia Magnética de columna dorsal",0,0,null,null,null,null,null,null,null,null,null,null,null,null,null,null,null,null,null,null,null,null,null,null,null,null,null,null,null,null,null,null,null,null,165910,0]
["0405007","Resonancia Magnética de columna lumbar",{"$f":"SUM(D679+G679)","v":0},{"$f":"SUM(E679:F679)","v":0},null,null,null,null,null,null,null,null,null,null,null,null,null,null,null,null,null,null,null,null,null,null,null,null,null,null,null,null,null,null,null,null,165910,0]
["0405017","Resonancia Magnética Angiografía de Encéfalo ",0,0,null,null,null,null,null,null,null,null,null,null,null,null,null,null,null,null,null,null,null,null,null,null,null,null,null,null,null,null,null,null,null,null,165910,0]
["0405018","Resonancia Magnética Angiografía de Cuello",0,0,null,null,null,null,null,null,null,null,null,null,null,null,null,null,null,null,null,null,null,null,null,null,null,null,null,null,null,null,null,null,null,null,165910,0]
["0405019","Resonancia Magnética Angiografía de Tórax ",0,0,null,null,null,null,null,null,null,null,null,null,null,null,null,null,null,null,null,null,null,null,null,null,null,null,null,null,null,null,null,null,null,null,165910,0]
["0405020","Resonancia Magnética Angiografía de Abdomen ",0,0,null,null,null,null,null,null,null,null,null,null,null,null,null,null,null,null,null,null,null,null,null,null,null,null,null,null,null,null,null,null,null,null,165910,0]
["0405021","Resonancia Magnética Angiografía de Pelvis ",0,0,null,null,null,null,null,null,null,null,null,null,null,null,null,null,null,null,null,null,null,null,null,null,null,null,null,null,null,null,null,null,null,null,165910,0]
["0405022","Resonancia Magnética  Angiografía de Extremidad Superior Unilateral ",0,0,null,null,null,null,null,null,null,null,null,null,null,null,null,null,null,null,null,null,null,null,null,null,null,null,null,null,null,null,null,null,null,null,165910,0]
["0405023","Resonancia Magnética  Angiografia de Extremidad Inferior Unilateral ",0,0,null,null,null,null,null,null,null,null,null,null,null,null,null,null,null,null,null,null,null,null,null,null,null,null,null,null,null,null,null,null,null,null,165910,0]
["0405009","Resonancia Magnética de Tórax.( corazón, esternón, clavículas, articulación acromioclavicular, escápula, costillas o articulación esternoclavicular). Toda la pared torácicao cada segmento o articulación.Bilateral",0,0,null,null,null,null,null,null,null,null,null,null,null,null,null,null,null,null,null,null,null,null,null,null,null,null,null,null,null,null,null,null,null,null,165910,0]
["0405010","Resonancia Magnética de abdomen ",0,0,null,null,null,null,null,null,null,null,null,null,null,null,null,null,null,null,null,null,null,null,null,null,null,null,null,null,null,null,null,null,null,null,165910,0]
["0405011","Resonancia Magnética de Pelvis. Incluye: osteoarticular de sacroiliacas u osteoarticular de sacrocoxis u osteoarticular de huesos pélvicos u órganos pelvianos (incluye genitales internos y gastrointestinal)",0,0,null,null,null,null,null,null,null,null,null,null,null,null,null,null,null,null,null,null,null,null,null,null,null,null,null,null,null,null,null,null,null,null,165910,0]
["0405012","Resonancia Magnética de abdomen y pelvis",0,0,null,null,null,null,null,null,null,null,null,null,null,null,null,null,null,null,null,null,null,null,null,null,null,null,null,null,null,null,null,null,null,null,248870,0]
["0405013","Resonancia Magnética de rodilla",0,0,null,null,null,null,null,null,null,null,null,null,null,null,null,null,null,null,null,null,null,null,null,null,null,null,null,null,null,null,null,null,null,null,136050,0]
["0405024","Resonancia Magnética de Mano o Muñeca ",{"$f":"SUM(D692+G692)","v":0},{"$f":"SUM(E692:F692)","v":0},null,null,null,null,null,null,null,null,null,null,null,null,null,null,null,null,null,null,null,null,null,null,null,null,null,null,null,null,null,null,null,null,136050,0]
["0405025","Resonancia Magnética de Antebrazo o Brazo ",0,0,null,null,null,null,null,null,null,null,null,null,null,null,null,null,null,null,null,null,null,null,null,null,null,null,null,null,null,null,null,null,null,null,136050,0]
["0405026","Resonancia Magnética de Codo ",0,0,null,null,null,null,null,null,null,null,null,null,null,null,null,null,null,null,null,null,null,null,null,null,null,null,null,null,null,null,null,null,null,null,136050,0]
["0405027","Resonancia Magnética de Hombro ",0,0,null,null,null,null,null,null,null,null,null,null,null,null,null,null,null,null,null,null,null,null,null,null,null,null,null,null,null,null,null,null,null,null,136050,0]
["0405028","Resonancia Magnética de Pie, Antepie o Tobillo ",0,0,null,null,null,null,null,null,null,null,null,null,null,null,null,null,null,null,null,null,null,null,null,null,null,null,null,null,null,null,null,null,null,null,136050,0]
["0405029","Resonancia Magnética de Pierna",0,0,null,null,null,null,null,null,null,null,null,null,null,null,null,null,null,null,null,null,null,null,null,null,null,null,null,null,null,null,null,null,null,null,136050,0]
["0405030","Resonancia Magnética de Muslo o Cadera. Unilateral",0,0,null,null,null,null,null,null,null,null,null,null,null,null,null,null,null,null,null,null,null,null,null,null,null,null,null,null,null,null,null,null,null,null,136050,0]
["0405031","Resonancia Magnética de Mama (bilateral)",0,0,null,null,null,null,null,null,null,null,null,null,null,null,null,null,null,null,null,null,null,null,null,null,null,null,null,null,null,null,null,null,null,null,136050,0]
["\"0405032","Resonancia Magnética fetal",0,0,null,null,null,null,null,null,null,null,null,null,null,null,null,null,null,null,null,null,null,null,null,null,null,null,null,null,null,null,null,null,null,null,null,0]
["0405016","Resonancia Columna Total (cervical, dorsal, lumbar)",0,0,null,null,null,null,null,null,null,null,null,null,null,null,null,null,null,null,null,null,null,null,null,null,null,null,null,null,null,null,null,null,null,null,298640,0]
["0405098","Colangioresonancia",0,0,null,null,null,null,null,null,null,null,null,null,null,null,null,null,null,null,null,null,null,null,null,null,null,null,null,null,null,null,null,null,null,null,111150,0]
[null,"TOTAL",{"$f":"SUM(C673:C702)","v":0},{"$f":"SUM(D673:D702)","v":0},{"$f":"SUM(E673:E702)","v":0},{"$f":"SUM(F673:F702)","v":0},{"$f":"SUM(G673:G702)","v":0},null,null,null,null,null,null,null,null,null,null,null,null,null,null,null,null,null,null,null,{"$f":"SUM(AA673:AA702)","v":0},0,0,0,0,0,0,0,0,0,4686480,0]
[null,"Otros Exámenes de Imágenes"]
["0403998","Cisternotac",0,0]
["0403999","Estereotaxia",0,0]
["\"0488884","Angiotac miembro superior",0,0]
["0488885","Angiotac miembro inferior",0,0]
[null,"Estudio de deglución faríngea por videofluroscopía",0,0]
[null,"Biopsia mamaria guíado por ecotomografía",0,0]
[null,"Ecotomografia portátil (traslado desde imagenología al servicio que lo requiere)",0,0]
[null,"Biopsia CORE de mama",0,0]
[null,"Procedimiento Bajo Eco (paaf, punción de partes blandas, drenajes)",0,0]
[null,"Marcación Ecográfica",0,0]
[null,"Angiotomografia  computarizada de corazón  con estudios de vasos coronarios ",0,0]
[null,"Angiotomografía corazón con estudio de vasos coronarios",0,0]
[null,"Cintigrama",0,0]
[null,"Cintigrama sestamibi",0,0]
[null,"Cintigrama tc - ec",0,0]
[null,"Estudio de Flujo de Liquido Cefalo Raquideo",0,0]
[null,"Resonancia Funcional",0,0]
[null,"Estudio de Tractografía",0,0]
[null,"Espectroscopía por RNM",0,0]
[null,"Cavidades para nasales",0,0]
[null,"Resonancia Magnética Fetal",0,0]
[null,"Perfusión por Resonancia Magnética",0,0]
[null,"Tóracocentesis guíado por ecotomografía",0,0]
[null,"Laparocentesis guíado por ecotomografía",0,0]
[null,"Ablación por radiofrecuencia de tumores guíado por ecotomografía",0,0]
[null,"Ablación por radiofrecuencia de tumores guíado por TAC",0,0]
[null,"Contraste paramagnético para resonancia magnética",0,0]
[null,"Contraste yodado hidrosoluble para tomografía computada",0,0]
[null,"Extracción de cuerpos extraños guíado por ecotomografía",0,0]
[null,"Marcación de microcalcificaciones preoperatorias guíada por mamografías ",0,0]
[null,"Marcación de nódulo mamario preoperatorio guíada por ultrasonido ",0,0]
[null,"Nefrostomía bajo TAC con Anestesia General",0,0]
[null,"Nefrostomía percutánea guíada en TAC",0,0]
[null,"Punción Citológica bajo Ecografía",0,0]
[null,"Punción Citológica bajo TAC",0,0]
[null,"Punción citológica de tiroides por ultrasonido",0,0]
[null,"Radiofrecuencia bajo TAC",0,0]
[null,"Asistencia ventricular en UCI",0,0]
[null,"Biopsia de lesiones de partes blandas guíado por ecotomografía",0,0]
[null,"Biopsia de tiroides con aguja fina PAAF",0,0]
[null,"Biopsia Ósea con Anestesia General",0,0]
[null,"Biopsia Ósea sin Anestesia General",{"$f":"SUM(D746+G746)","v":0},{"$f":"SUM(E746:F746)","v":0}]
[null,"Biopsia Percutanea bajo Ecografía con Anestesia General",0,0]
[null,"Biopsia Percutanea bajo TAC con Anestesia General",0,0]
[null,"Biopsia de médula",0,0]
[null,"Biopsia hepática",0,0]
[null,"Biopsia muscular",0,0]
[null,"Biopsia de nervio",0,0]
[null,"Biopsia rápida en quirófano",0,0]
[null,"Infiltraciones terapéuticas guíado por ecotomografía",0,0]
[null,"Artrocentesis (drenaje articular) diagnóstico y terapéutico guíado por ecotomografía",0,0]
[null,"Aspiración tendinitis calcificante del hombre guíado por ecotomografía",0,0]
[null,"Calculo de reserva Fraccional de Flujo",0,0]
[null,"Drenaje de colecciones guíado por ecotomografía",0,0]
[null,"Drenaje de colecciones guíado por tomografía computada",0,0]
[null,"Drenaje Percutaneo bajo TAC con Anestesia General",0,0]
[null,"Drenaje Percutaneo bajo TAC sin Anestesia General",0,0]
[null,"TOTAL",{"$f":"SUM(C705:C761)","v":0},{"$f":"SUM(D705:D761)","v":0},{"$f":"SUM(E705:E761)","v":0},{"$f":"SUM(F705:F761)","v":0},{"$f":"SUM(G705:G761)","v":0},null,null,null,null,null,null,null,null,null,null,null,null,null,null,null,null,null,null,null,{"$f":"SUM(AA705:AA761)","v":0},0,0,0,0,0,0,0,0,0]
[null,"5.- ESTUDIOS NEFROUROLÓGICOS"]
["0501117","Cintigrafía renal con D.M.S.A.",0,0,null,null,null,null,null,null,null,null,null,null,null,null,null,null,null,null,null,null,null,null,null,null,null,null,null,null,null,null,null,null,null,null,28480,{"$f":"SUM(AK764*E764)","v":0}]
["0501118","Estudio dinámico renal con Tc 99 - DTPA",0,0,null,null,null,null,null,null,null,null,null,null,null,null,null,null,null,null,null,null,null,null,null,null,null,null,null,null,null,null,null,null,null,null,42730,{"$f":"SUM(AK765*E765)","v":0}]
["0501119","Estudio dinámico renal con Tc 99 - MAG 3 o EC",0,0,null,null,null,null,null,null,null,null,null,null,null,null,null,null,null,null,null,null,null,null,null,null,null,null,null,null,null,null,null,null,null,null,74070,{"$f":"SUM(AK766*E766)","v":0}]
["0501120","Cistografía isotópica indirecta",0,0,null,null,null,null,null,null,null,null,null,null,null,null,null,null,null,null,null,null,null,null,null,null,null,null,null,null,null,null,null,null,null,null,28480,{"$f":"SUM(AK767*E767)","v":0}]
["0501121","Cistografía isotópica directa (no incluye procedimiento)",0,0,null,null,null,null,null,null,null,null,null,null,null,null,null,null,null,null,null,null,null,null,null,null,null,null,null,null,null,null,null,null,null,null,28480,{"$f":"SUM(AK768*E768)","v":0}]
[null,"TOTAL",{"$f":"SUM(C764:C768)","v":0},{"$f":"SUM(D764:D768)","v":0},{"$f":"SUM(E764:E768)","v":0},{"$f":"SUM(F764:F768)","v":0},{"$f":"SUM(G764:G768)","v":0},null,null,null,null,null,null,null,null,null,null,null,null,null,null,null,null,null,null,null,{"$f":"SUM(AA764:AA768)","v":0},0,0,{"$f":"SUM(AD764:AD768)","v":0},0,0,0,0,0,0,{"$f":"SUM(AK764:AK768)","v":202240},{"$f":"SUM(AL764:AL768)","v":0}]
["GRUPO 05 : MEDICINA NUCLEAR Y RADIOTERAPIA       "]
["A.PROCEDIMIENTOS DIAGNOSTICOS                             "]
[null,"1.- ESTUDIOS ENDOCRINOLÓGICOS (Estáticos)"]
["0501100","Captación I-131 a las 2 y/o 24 horas",0,0,null,null,null,null,null,null,null,null,null,null,null,null,null,null,null,null,null,null,null,null,null,null,null,null,null,null,null,null,null,null,null,null,18980,{"$f":"AK773*E773","v":0}]
["0501101","Cintigrafía tiroidea, cualquier radioisótopo",0,0,null,null,null,null,null,null,null,null,null,null,null,null,null,null,null,null,null,null,null,null,null,null,null,null,null,null,null,null,null,null,null,null,18980,{"$f":"AK774*E774","v":0}]
["0501102","Cintigrafía  glándulas paratiroides (no incluye MIBI)",0,0,null,null,null,null,null,null,null,null,null,null,null,null,null,null,null,null,null,null,null,null,null,null,null,null,null,null,null,null,null,null,null,null,28480,{"$f":"AK775*E775","v":0}]
[null,"TOTAL",{"$f":"SUM(C773:C775)","v":0},{"$f":"SUM(D773:D775)","v":0},{"$f":"SUM(E773:E775)","v":0},{"$f":"SUM(F773:F775)","v":0},{"$f":"SUM(G773:G775)","v":0},null,null,null,null,null,null,null,null,null,null,null,null,null,null,null,null,null,null,null,{"$f":"SUM(AA773:AA775)","v":0},0,0,{"$f":"SUM(AD773:AD775)","v":0},0,0,0,0,0,0,66440,0]
[null,"2.- ESTUDIOS OSTEOARTICULARES"]
["0501103","Cintigrafía ósea completa planar o médula ósea (a.c. 0501133, cuando corresponda)",0,0,null,null,null,null,null,null,null,null,null,null,null,null,null,null,null,null,null,null,null,null,null,null,null,null,null,null,null,null,null,null,null,null,51290,{"$f":"AK778*E778","v":0}]
["0501104","Cintigrafía ósea trifásica (incluye mediciones fase precoz y tardía)",0,0,null,null,null,null,null,null,null,null,null,null,null,null,null,null,null,null,null,null,null,null,null,null,null,null,null,null,null,null,null,null,null,null,75980,{"$f":"AK779*E779","v":0}]
[null,"TOTAL",{"$f":"SUM(C778:C779)","v":0},{"$f":"SUM(D778:D779)","v":0},{"$f":"SUM(E778:E779)","v":0},{"$f":"SUM(F778:F779)","v":0},{"$f":"SUM(G778:G779)","v":0},null,null,null,null,null,null,null,null,null,null,null,null,null,null,null,null,null,null,null,{"$f":"SUM(AA778:AA779)","v":0},0,0,{"$f":"SUM(AD778:AD779)","v":0},0,0,0,0,0,0,127270,0]
[null,"3.- ESTUDIOS CARDIOVASCULARES"]
["0501105","Spect cardíaco stress y reposo (no incluye honorarios médico cardiólogo)",0,0,null,null,null,null,null,null,null,null,null,null,null,null,null,null,null,null,null,null,null,null,null,null,null,null,null,null,null,null,null,null,null,null,138070,{"$f":"AK782*E782","v":0}]
["0501106","Ventriculografía cardiaca isotópica de equilibrio con glóbulos rojos",0,0,null,null,null,null,null,null,null,null,null,null,null,null,null,null,null,null,null,null,null,null,null,null,null,null,null,null,null,null,null,null,null,null,42730,{"$f":"AK783*E783","v":0}]
["0501107","Pool sanguíneo, arteriografia isotópica c/u",0,0,null,null,null,null,null,null,null,null,null,null,null,null,null,null,null,null,null,null,null,null,null,null,null,null,null,null,null,null,null,null,null,null,18980,{"$f":"AK784*E784","v":0}]
["0501108","Linfocintigrafía isotópica (no incluye procedimiento)",0,0,null,null,null,null,null,null,null,null,null,null,null,null,null,null,null,null,null,null,null,null,null,null,null,null,null,null,null,null,null,null,null,null,56980,{"$f":"AK785*E785","v":0}]
["0501109","Pool sanguíneo spect",0,0,null,null,null,null,null,null,null,null,null,null,null,null,null,null,null,null,null,null,null,null,null,null,null,null,null,null,null,null,null,null,null,null,56980,{"$f":"AK786*E786","v":0}]
[null,"TOTAL",{"$f":"SUM(C782:C786)","v":0},{"$f":"SUM(D782:D786)","v":0},{"$f":"SUM(E782:E786)","v":0},{"$f":"SUM(F782:F786)","v":0},{"$f":"SUM(G782:G786)","v":0},null,null,null,null,null,null,null,null,null,null,null,null,null,null,null,null,null,null,null,{"$f":"SUM(AA782:AA786)","v":0},0,0,0,0,0,0,0,0,0,313740,0]
[null,"4.- ESTUDIOS DIGESTIVOS"]
["0501110","Cintigrafía glándulas salivales o dacriocintigrafía",0,0,null,null,null,null,null,null,null,null,null,null,null,null,null,null,null,null,null,null,null,null,null,null,null,null,null,null,null,null,null,null,null,null,28480,{"$f":"AK789*E789","v":0}]
["0501111","Estudio motilidad esofágica y/o reflujo gastroesofágico",0,0,null,null,null,null,null,null,null,null,null,null,null,null,null,null,null,null,null,null,null,null,null,null,null,null,null,null,null,null,null,null,null,null,42730,0]
["0501112","Vaciamiento gástrico líquido o sólido",0,0,null,null,null,null,null,null,null,null,null,null,null,null,null,null,null,null,null,null,null,null,null,null,null,null,null,null,null,null,null,null,null,null,75980,0]
["0501113","Cintigrafía vesícula y vía biliar",0,0,null,null,null,null,null,null,null,null,null,null,null,null,null,null,null,null,null,null,null,null,null,null,null,null,null,null,null,null,null,null,null,null,85470,0]
["0501114","Detección de sitio de sangramiento digestivo con glóbulos rojos marcados",0,0,null,null,null,null,null,null,null,null,null,null,null,null,null,null,null,null,null,null,null,null,null,null,null,null,null,null,null,null,null,null,null,null,94970,0]
["0501115","Detección divertículo Meckel",0,0,null,null,null,null,null,null,null,null,null,null,null,null,null,null,null,null,null,null,null,null,null,null,null,null,null,null,null,null,null,null,null,null,28480,0]
["0501116","Spect hepatoesplénico, evaluación hemangioma o hiperplasia (incluye mediciones fase precoz y tardía)",0,0,null,null,null,null,null,null,null,null,null,null,null,null,null,null,null,null,null,null,null,null,null,null,null,null,null,null,null,null,null,null,null,null,85470,0]
[null,"TOTAL",{"$f":"SUM(C789:C795)","v":0},{"$f":"SUM(D789:D795)","v":0},{"$f":"SUM(E789:E795)","v":0},{"$f":"SUM(F789:F795)","v":0},{"$f":"SUM(G789:G795)","v":0},null,null,null,null,null,null,null,null,null,null,null,null,null,null,null,null,null,null,null,{"$f":"SUM(AA789:AA795)","v":0},0,0,{"$f":"SUM(AD789:AD795)","v":0},0,0,0,0,0,0,441580,0]
[null,"6.- ESTUDIOS PULMONARES (dinámicos)"]
["0501122","Cintigrafía pulmonar perfusión o ventilación o difusión, c/u",0,0,null,null,null,null,null,null,null,null,null,null,null,null,null,null,null,null,null,null,null,null,null,null,null,null,null,null,null,null,null,null,null,null,28480,{"$f":"AK798*E798","v":0}]
["0501123","Cintigrafía y estudio aspiración pulmonar",0,0,null,null,null,null,null,null,null,null,null,null,null,null,null,null,null,null,null,null,null,null,null,null,null,null,null,null,null,null,null,null,null,null,28480,{"$f":"AK799*E799","v":0}]
[null,"TOTAL",{"$f":"SUM(C798:C799)","v":0},{"$f":"SUM(D798:D799)","v":0},{"$f":"SUM(E798:E799)","v":0},{"$f":"SUM(F798:F799)","v":0},{"$f":"SUM(G798:G799)","v":0},null,null,null,null,null,null,null,null,null,null,null,null,null,null,null,null,null,null,null,{"$f":"SUM(AA798:AA799)","v":0},0,0,{"$f":"SUM(AD798:AD799)","v":0},0,0,0,0,0,0,56960,0]
[null,"7.- ESTUDIOS SISTEMA NERVIOSO CENTRAL"]
["0501124","Spect cerebral de perfusión (no incluye radiofármaco)",0,0,null,null,null,null,null,null,null,null,null,null,null,null,null,null,null,null,null,null,null,null,null,null,null,null,null,null,null,null,null,null,null,null,56980,{"$f":"AK802*E802","v":0}]
["0501125","Estudio dinámico sistema nervioso (radiocisternografia, fístula L.C.R, radioventriculografía, control válvula derivatíva, sub-durografía isotópica), c/u (no incluye procedimiento).",0,0,null,null,null,null,null,null,null,null,null,null,null,null,null,null,null,null,null,null,null,null,null,null,null,null,null,null,null,null,null,null,null,null,56980,{"$f":"AK803*E803","v":0}]
[null,"TOTAL",{"$f":"SUM(C802:C803)","v":0},{"$f":"SUM(D802:D803)","v":0},{"$f":"SUM(E802:E803)","v":0},{"$f":"SUM(F802:F803)","v":0},{"$f":"SUM(G802:G803)","v":0},null,null,null,null,null,null,null,null,null,null,null,null,null,null,null,null,null,null,null,{"$f":"SUM(AA802:AA803)","v":0},{"$f":"SUM(AB802:AB803)","v":0},0,0,0,0,0,0,0,0,113960,0]
[null,"8.- ESTUDIOS DE INFECCIONES"]
["0501126","Cintigrafía evaluación infecciones (leucocitos, infecton, granulocitos u otros) (no incluye radiofármaco ni procedimiento).",0,0,null,null,null,null,null,null,null,null,null,null,null,null,null,null,null,null,null,null,null,null,null,null,null,null,null,null,null,null,null,null,null,null,56980,{"$f":"AK806*E806","v":0}]
["0501127","Cintigrafía con galio-67 planar infección (no incluye radioisótopo) (a.c. 0501133, cuando corresponda)",0,0,null,null,null,null,null,null,null,null,null,null,null,null,null,null,null,null,null,null,null,null,null,null,null,null,null,null,null,null,null,null,null,null,56980,{"$f":"AK807*E807","v":0}]
[null,"TOTAL",{"$f":"SUM(C806:C807)","v":0},{"$f":"SUM(D806:D807)","v":0},{"$f":"SUM(E806:E807)","v":0},{"$f":"SUM(F806:F807)","v":0},{"$f":"SUM(G806:G807)","v":0},null,null,null,null,null,null,null,null,null,null,null,null,null,null,null,null,null,null,null,{"$f":"SUM(AA806:AA807)","v":0},0,0,{"$f":"SUM(AD806:AD807)","v":0},0,0,0,0,0,0,113960,0]
[null,"9.- ESTUDIOS ONCOLÓGICOS"]
["0501128","Detección y/o marcación de ganglio centinela, no incluye, punción ni detección con gammaprobe",0,0,null,null,null,null,null,null,null,null,null,null,null,null,null,null,null,null,null,null,null,null,null,null,null,null,null,null,null,null,null,null,null,null,56980,{"$f":"AK810*E810","v":0}]
["0501129","Cintigrafía con galio-67 planar y Spect, para estudio de tumores (no incluye radioisótopo)",0,0,null,null,null,null,null,null,null,null,null,null,null,null,null,null,null,null,null,null,null,null,null,null,null,null,null,null,null,null,null,null,null,null,142430,0]
["0501130","Exploración sistémica con I-131 (incluye mediciones fase precoz y tardía)",0,0,null,null,null,null,null,null,null,null,null,null,null,null,null,null,null,null,null,null,null,null,null,null,null,null,null,null,null,null,null,null,null,null,85470,0]
["0501131","Estudio glándulas mamarias (mamocintigrafia) (no incluye MIBI)",0,0,null,null,null,null,null,null,null,null,null,null,null,null,null,null,null,null,null,null,null,null,null,null,null,null,null,null,null,null,null,null,null,null,37970,0]
["0501132","Estudio de tumores (anticuerpos monoclonales, octreoscan, DMSA pentavalente, prostacint u otros) (no incluye radioisótopo)",0,0,null,null,null,null,null,null,null,null,null,null,null,null,null,null,null,null,null,null,null,null,null,null,null,null,null,null,null,null,null,null,null,null,113940,0]
["0501133","Spect - Tomografía por emisión foton único, cualquier órgano (no incluye radioisótopo)",0,0,null,null,null,null,null,null,null,null,null,null,null,null,null,null,null,null,null,null,null,null,null,null,null,null,null,null,null,null,null,null,null,null,42730,0]
[null,"TOTAL",{"$f":"SUM(C810:C815)","v":0},{"$f":"SUM(D810:D815)","v":0},{"$f":"SUM(E810:E815)","v":0},{"$f":"SUM(F810:F815)","v":0},{"$f":"SUM(G810:G815)","v":0},null,null,null,null,null,null,null,null,null,null,null,null,null,null,null,null,null,null,null,{"$f":"SUM(AA810:AA815)","v":0},0,0,{"$f":"SUM(AD810:AD815)","v":0},0,0,0,0,0,0,479520,0]
[null,"10.- DENSITOMETRÍA OSEA"]
["0501134","Densitometría ósea a fotón doble, columna y cadera (unilateral o bilateral) o cuerpo entero",0,0,null,null,null,null,null,null,null,null,null,null,null,null,null,null,null,null,null,null,null,null,null,null,null,null,null,null,null,null,null,null,null,null,28850,{"$f":"AK818*E818","v":0}]
[null,"TOTAL",{"$f":"C818","v":0},{"$f":"D818","v":0},{"$f":"E818","v":0},{"$f":"F818","v":0},{"$f":"G818","v":0},null,null,null,null,null,null,null,null,null,null,null,null,null,null,null,null,null,null,null,{"$f":"AA818","v":0},0,0,0,0,0,0,0,0,0,28850,0]
[null,"B.PROCEDIMIENTOS TERAPEUTICOS.                      "]
[null,"I. RADIOISOTOPOS"]
["0502001","Dosis terapéuticas con I-131 hasta 30 mCi.",{"$f":"SUM(D822+G822)","v":0},{"$f":"SUM(E822:F822)","v":0},null,null,null,null,null,null,null,null,null,null,null,null,null,null,null,null,null,null,null,null,null,null,null,null,null,null,null,null,null,null,null,null,66460,{"$f":"AK822*E822","v":0}]
["0502002","Dosis terapéuticas con I-131 entre 31 a 100 mCi.",0,0,null,null,null,null,null,null,null,null,null,null,null,null,null,null,null,null,null,null,null,null,null,null,null,null,null,null,null,null,null,null,null,null,128190,{"$f":"AK823*E823","v":0}]
["0502003","Dosis terapéuticas con I-131 entre 101 a 200 mCi.",0,0,null,null,null,null,null,null,null,null,null,null,null,null,null,null,null,null,null,null,null,null,null,null,null,null,null,null,null,null,null,null,null,null,227920,{"$f":"AK824*E824","v":0}]
["0502004","Dosis terapéuticas con I-131 entre 201 a 300 mCi.",0,0,null,null,null,null,null,null,null,null,null,null,null,null,null,null,null,null,null,null,null,null,null,null,null,null,null,null,null,null,null,null,null,null,327570,{"$f":"AK825*E825","v":0}]
["0502005","Terapia paliativa del dolor con radioisótopos (no incluye radiofármaco)",0,0,null,null,null,null,null,null,null,null,null,null,null,null,null,null,null,null,null,null,null,null,null,null,null,null,null,null,null,null,null,null,null,null,28480,{"$f":"AK826*E826","v":0}]
[null,"TOTAL",{"$f":"SUM(C822:C826)","v":0},{"$f":"SUM(D822:D826)","v":0},{"$f":"SUM(E822:E826)","v":0},{"$f":"SUM(F822:F826)","v":0},{"$f":"SUM(G822:G826)","v":0},null,null,null,null,null,null,null,null,null,null,null,null,null,null,null,null,null,null,null,{"$f":"SUM(AA822:AA826)","v":0},{"$f":"SUM(AB822:AB826)","v":0},{"$f":"SUM(AC822:AC826)","v":0},{"$f":"SUM(AD822:AD826)","v":0},0,0,0,0,0,0,778620,0]
[null,"II.RADIOTERAPIA                                                                                        "]
[null,"BRAQUITERAPIA"]
["0503001","Endocavitaria o intersticial (radium, cesio o iridium)",0,0,null,null,null,null,null,null,null,null,null,null,null,null,null,null,null,null,null,null,null,null,null,null,null,null,null,null,null,null,null,null,null,null,183360,{"$f":"AK830*E830","v":0}]
["0503003","Superficial (estroncio)",0,0,null,null,null,null,null,null,null,null,null,null,null,null,null,null,null,null,null,null,null,null,null,null,null,null,null,null,null,null,null,null,null,null,63810,{"$f":"AK831*E831","v":0}]
[null,"TOTAL",{"$f":"SUM(C830:C831)","v":0},{"$f":"SUM(D830:D831)","v":0},{"$f":"SUM(E830:E831)","v":0},{"$f":"SUM(F830:F831)","v":0},{"$f":"SUM(G830:G831)","v":0},null,null,null,null,null,null,null,null,null,null,null,null,null,null,null,null,null,null,null,{"$f":"SUM(AA830:AA831)","v":0},0,0,{"$f":"SUM(AD830:AD831)","v":0},0,0,0,0,0,0,247170,0]
[null,"RADIOTERAPIA CON ACELERADOR LINEAL DE ELECTRONES                                  "]
["0504001","Cáncer de esófago pre o postoperatorio",0,0,null,null,null,null,null,null,null,null,null,null,null,null,null,null,null,null,null,null,null,null,null,null,null,null,null,null,null,null,null,null,null,null,447220,{"$f":"AK834*E834","v":0}]
["0504002","Cáncer de esófago sin intervención quir.",0,0,null,null,null,null,null,null,null,null,null,null,null,null,null,null,null,null,null,null,null,null,null,null,null,null,null,null,null,null,null,null,null,null,505440,0]
["0504003","Cáncer de mama sin intervención quir.",0,0,null,null,null,null,null,null,null,null,null,null,null,null,null,null,null,null,null,null,null,null,null,null,null,null,null,null,null,null,null,null,null,null,563540,0]
["0504004","Radioterapia, cáncer de mama, trat. Postoperatorio (tumorectomía; mastectomía parcial, total o radical)",0,0,null,null,null,null,null,null,null,null,null,null,null,null,null,null,null,null,null,null,null,null,null,null,null,null,null,null,null,null,null,null,null,null,505440,0]
["0504005","Cáncer de órganos de abdomen y/o pelvis, excepto útero",0,0,null,null,null,null,null,null,null,null,null,null,null,null,null,null,null,null,null,null,null,null,null,null,null,null,null,null,null,null,null,null,null,null,563540,0]
["0504006","Cáncer de órganos de cabeza y/o cuello",0,0,null,null,null,null,null,null,null,null,null,null,null,null,null,null,null,null,null,null,null,null,null,null,null,null,null,null,null,null,null,null,null,null,505440,0]
["0504007","Cáncer de piel",0,0,null,null,null,null,null,null,null,null,null,null,null,null,null,null,null,null,null,null,null,null,null,null,null,null,null,null,null,null,null,null,null,null,447220,0]
["0504008","Cáncer de pulmón o esófago torácico",0,0,null,null,null,null,null,null,null,null,null,null,null,null,null,null,null,null,null,null,null,null,null,null,null,null,null,null,null,null,null,null,null,null,505440,0]
["0504009","Cáncer de testículo",0,0,null,null,null,null,null,null,null,null,null,null,null,null,null,null,null,null,null,null,null,null,null,null,null,null,null,null,null,null,null,null,null,null,447220,0]
["0504010","Cáncer uterino (cuello y/o endometrio)",0,0,null,null,null,null,null,null,null,null,null,null,null,null,null,null,null,null,null,null,null,null,null,null,null,null,null,null,null,null,null,null,null,null,563540,0]
["0504011","Leucemia tratamiento de",0,0,null,null,null,null,null,null,null,null,null,null,null,null,null,null,null,null,null,null,null,null,null,null,null,null,null,null,null,null,null,null,null,null,330820,0]
["0504012","Linfoma maligno irradiación ganglionar total",0,0,null,null,null,null,null,null,null,null,null,null,null,null,null,null,null,null,null,null,null,null,null,null,null,null,null,null,null,null,null,null,null,null,894230,0]
["0504013","Linfomas malignos, trat. parcial",0,0,null,null,null,null,null,null,null,null,null,null,null,null,null,null,null,null,null,null,null,null,null,null,null,null,null,null,null,null,null,null,null,null,447220,0]
["0504014","Paliativo en cáncer metastásico (cualquier localización) (mínimo 2.500 rads. en cada zona anatómica simultánea)",0,0,null,null,null,null,null,null,null,null,null,null,null,null,null,null,null,null,null,null,null,null,null,null,null,null,null,null,null,null,null,null,null,null,272810,0]
["0504015","Sarcoma óseo o de partes blandas",0,0,null,null,null,null,null,null,null,null,null,null,null,null,null,null,null,null,null,null,null,null,null,null,null,null,null,null,null,null,null,null,null,null,505440,0]
["0504016","Tumores del sistema nervioso central",0,0,null,null,null,null,null,null,null,null,null,null,null,null,null,null,null,null,null,null,null,null,null,null,null,null,null,null,null,null,null,null,null,null,505440,0]
[null,"TOTAL",{"$f":"SUM(C834:C849)","v":0},{"$f":"SUM(D834:D849)","v":0},{"$f":"SUM(E834:E849)","v":0},{"$f":"SUM(F834:F849)","v":0},{"$f":"SUM(G834:G849)","v":0},null,null,null,null,null,null,null,null,null,null,null,null,null,null,null,null,null,null,null,{"$f":"SUM(AA834:AA849)","v":0},0,0,{"$f":"SUM(AD834:AD849)","v":0},0,0,0,0,0,0,8010000,0]
[null,"TELECOBALTOTERAPIA                                        "]
["0505001","Cáncer de esófago pre o postoperatorio",0,0,null,null,null,null,null,null,null,null,null,null,null,null,null,null,null,null,null,null,null,null,null,null,null,null,null,null,null,null,null,null,null,null,355930,{"$f":"AK852*E852","v":0}]
["0505002","Cáncer de esófago sin intervención quir.",0,0,null,null,null,null,null,null,null,null,null,null,null,null,null,null,null,null,null,null,null,null,null,null,null,null,null,null,null,null,null,null,null,null,402160,0]
["0505003","Cáncer de mama, trat. postoperatorio (tumorectomía; mastectomía parcial, total o radical)",0,0,null,null,null,null,null,null,null,null,null,null,null,null,null,null,null,null,null,null,null,null,null,null,null,null,null,null,null,null,null,null,null,null,448420,0]
["0505004","Cáncer de mama sin intervención quir.",0,0,null,null,null,null,null,null,null,null,null,null,null,null,null,null,null,null,null,null,null,null,null,null,null,null,null,null,null,null,null,null,null,null,402160,0]
["0505005","Cáncer de órganos de abdomen y/o pelvis, excepto útero",0,0,null,null,null,null,null,null,null,null,null,null,null,null,null,null,null,null,null,null,null,null,null,null,null,null,null,null,null,null,null,null,null,null,448420,0]
["0505006","Cáncer de órganos de cabeza y cuello",0,0,null,null,null,null,null,null,null,null,null,null,null,null,null,null,null,null,null,null,null,null,null,null,null,null,null,null,null,null,null,null,null,null,402160,0]
["0505007","Cáncer de piel",0,0,null,null,null,null,null,null,null,null,null,null,null,null,null,null,null,null,null,null,null,null,null,null,null,null,null,null,null,null,null,null,null,null,355930,0]
["0505008","Cáncer de pulmón o esófago torácico",0,0,null,null,null,null,null,null,null,null,null,null,null,null,null,null,null,null,null,null,null,null,null,null,null,null,null,null,null,null,null,null,null,null,402160,0]
["0505009","Cáncer de testículo",0,0,null,null,null,null,null,null,null,null,null,null,null,null,null,null,null,null,null,null,null,null,null,null,null,null,null,null,null,null,null,null,null,null,355930,0]
["0505010","Cáncer uterino (cuello y/o endometrio)",0,0,null,null,null,null,null,null,null,null,null,null,null,null,null,null,null,null,null,null,null,null,null,null,null,null,null,null,null,null,null,null,null,null,448420,0]
["0505011","Leucemia, trat. de",0,0,null,null,null,null,null,null,null,null,null,null,null,null,null,null,null,null,null,null,null,null,null,null,null,null,null,null,null,null,null,null,null,null,263250,0]
["0505012","Linfoma maligno irradiación ganglionar total",0,0,null,null,null,null,null,null,null,null,null,null,null,null,null,null,null,null,null,null,null,null,null,null,null,null,null,null,null,null,null,null,null,null,711660,0]
["0505013","Linfomas malignos, trat. parcial",0,0,null,null,null,null,null,null,null,null,null,null,null,null,null,null,null,null,null,null,null,null,null,null,null,null,null,null,null,null,null,null,null,null,355930,0]
["0505014","Paliativo en cáncer metastásico (cualquier localización) mínimo 2.500 rads en cada zona anatómica simultánea",0,0,null,null,null,null,null,null,null,null,null,null,null,null,null,null,null,null,null,null,null,null,null,null,null,null,null,null,null,null,null,null,null,null,217040,0]
["0505015","Sarcoma óseo o de partes blandas",0,0,null,null,null,null,null,null,null,null,null,null,null,null,null,null,null,null,null,null,null,null,null,null,null,null,null,null,null,null,null,null,null,null,402160,0]
["0505016","Tumores del sistema nervioso central",0,0,null,null,null,null,null,null,null,null,null,null,null,null,null,null,null,null,null,null,null,null,null,null,null,null,null,null,null,null,null,null,null,null,402160,0]
[null,"TOTAL",{"$f":"SUM(C852:C867)","v":0},{"$f":"SUM(D852:D867)","v":0},{"$f":"SUM(E852:E867)","v":0},{"$f":"SUM(F852:F867)","v":0},{"$f":"SUM(G852:G867)","v":0},null,null,null,null,null,null,null,null,null,null,null,null,null,null,null,null,null,null,null,{"$f":"SUM(AA852:AA867)","v":0},0,0,{"$f":"SUM(AD852:AD867)","v":0},0,0,0,0,0,0,6373890,0]
[null,"KINESIOLOGIA Y FISIOTERAPIA "]
["0601001","Evaluación kinesiológica: muscular, articular, postural, neurológica y funcional (máximo 2 por tratamiento)",0,0]
["0601003","Evaluación Biomecánica instrumental",0,0]
["0601004","Piscina temperada (incluye ejercicios) (proc.aut.)",0,0]
["0601005","Radiación infrarroja, horno, baño parafina, compresas húmedas, c/u (proc.aut.)",0,0]
["0601006","Tanque de Hubbard con ejercicios (hiper o hipo-termal sobre 1.000 lts de capacidad) (proc.aut.)",0,0]
["0601007","Turbión, tanque con remolino (hiper o hipotermal,baño de contraste) (proc.aut.)",0,0]
["0601010","Terapia por radiación ultravioleta. (proc.aut.)",0,0]
["0601008","Laserterapia (proc.aut.)",0,0]
["0601009","Onda corta (ultratermia), microondas, c/u (proc.aut.)",0,0]
["0601011","Terapia por ondas mecánicas (proc. aut.)",0,0]
["0601012","Analgesia transcutánea (TENS) (proc.aut.)",0,0]
["0601013","Estimulación eléctrica (interferencial, diadinámicas, exponenciales, galvánica, faradica, ultraexcitante) (proc.aut.)",0,0]
["0601014"," Iontoforesis (proc.aut.)",0,0]
["0601015","Retroalimentación neuromuscular (miofeedback) (proc.aut.)",0,0]
["0601016","Compresión neumática (masaje compresivo) (proc.aut.)",0,0]
["0601027","Tracción cervical y/o lumbar (mecánica o manual) (proc.aut.)",0,0]
["0601029","Atención kinesiológica integral",0,0]
["0601017","Ejercicios respiratorios y procedimientos de kinesiterápia torácica (ventilación pulmonar localizada, estimulación de la tos, bloqueos torácicos, vibraciones, percusiones y tapoteos) (proc.aut.)",0,0]
["0601028","Entrenamiento cardiorespiratorio funcional",0,0]
["0601018","Prueba de esfuerzo o Entrenamiento ergométrico (porc.aut.)",{"$f":"SUM(D889+G889)","v":0},{"$f":"SUM(E889:F889)","v":0}]
["0601019","Entrenamiento funcional con ayudas técnicas (órtesis, ayudas de desplazamiento, etc.) (proc.aut.)",0,0]
["0601020","Entrenamiento protésico extremidades (proc.aut.)",0,0]
["0601021","Manipulación osteopática (liberación articular, manipulación vertebral) (proc.aut.)",0,0]
["0601022","Masoterapia, por sesión (proc.aut.)",0,0]
["0601023","Orientación y entrenamiento de personas con baja visión o con ceguera (proc.aut.)",0,0]
["0601024","Reeducación motriz (ejercicios terapéuticos para recuperación muscular, capacidad de trabajo, coordinación, gimnasia ortopédica, reeducación funcional, de marcha) (individual y por sesión, mínimo 30 minutos) (proc.aut.)",0,0]
["0601025","Técnicas de facilitación, técnicas de inhibición  (Kabat y/o Bobath) (proc.aut.)",0,0]
["0601026","Técnicas de relajación (entrenamiento autógeno Schultz - Jacobson o similar) (proc.aut.)",0,0]
["0601030","Maniobras permeabilización de la vía aérea (proc.aut.)",0,0]
["0601031","Atención kinesiológica integral, al enfermo hosp. en UTI o Intermedio (máx. 1 diaria)",0,0]
["0601171","Asistencia en IOT, VMNI, cambio de cánula de traqueostomía",0,0]
["0601181","Entrenamiento ortostático en mesa basculante",0,0]
["0102503","Evaluación de la deglución",0,0]
["0102504","Rehabilitación de la deglución ",0,0]
["0102501","Reeducación de la tos y respiración en pacientes con traqueostomía",0,0]
["0102505","Evaluación de funciones cognitivas",0,0]
["0102506","Rehabilitación de funciones cognitivas",0,0]
[null,"Deep oscilación",0,0]
[null,"Plataforma Vibratoria",0,0]
[null,"Rehabilitación  virtual en BRU",0,0]
[null,"Vocastim",0,0]
[null,"Prueba de tolerancia ortostática",0,0]
[null,"Rehabilitación vestibular",0,0]
[null,"Asistencia bloqueo espasticidad",0,0]
[null,"Punción seca",0,0]
[null,"Neurodinamia",0,0]
[null,"Entrenamiento ortésico de gran incapacitado",0,0]
[null,"Evaluación  y rehabilitación en actividades de la vida diaria",0,0]
[null,"Evaluación funcional",0,0]
[null,"Habilitación y rehabilitación laboral",0,0]
[null,"Habilitación y rehabilitación educacional",0,0]
[null,"Integración sensorial",0,0]
[null,"Evaluación de deglución",0,0]
[null,"Manejo de trastorno de deglución",0,0]
[null,"Infiltración intraneuromuscular (fenol y toxina botulínica)",0,0]
[null,"Estimulación cognitiva grupal",0,0]
[null,"Estimulación magnética",0,0]
[null,"Atención integral en demencia",0,0]
[null,"Entrenamiento ortésico de gran incapacitado (proc.aut) ",0,0]
[null,"TOTAL",{"$f":"SUM(C870:C928)","v":0},{"$f":"SUM(D870:D928)","v":0},0,0,0,null,null,null,null,null,null,null,null,null,null,null,null,null,null,null,null,null,null,null,0,{"$f":"SUM(AB870:AB928)","v":0},0,0,0,0,0,0,0,0]
[null," GRUPO 07 : MEDICINA TRANSFUSIONAL "]
["0702001","Preparación de glóbulos rojos, plasma, plaquetas o crioprecipitados (incluye entrevista, selección del donante y la preparación del respectivo hemocomponente)",0,0,null,null,null,null,null,null,null,null,null,null,null,null,null,null,null,null,null,null,null,null,null,null,null,null,null,null,null,null,null,null,null,null,8700,{"$f":"AK931*E931","v":0}]
["0702002","Obtención y preparación automatizada de plaquetas en donante único, con máquina separadora celular (proc. completo)",0,0,null,null,null,null,null,null,null,null,null,null,null,null,null,null,null,null,null,null,null,null,null,null,null,null,null,null,null,null,null,null,null,null,212100,0]
["0702003","Set de  Exámenes por unidad de  Glóbulos   Rojos transfundida (incluye clasificación ABO y Rho, VDRL, HIV, virus hepatitis B antígeno de superficie, anticuerpos de hepatitis  C,   HTLV - I y II,   Chagas,  prueba  de compatibilidad  eritrocitaria)  ",0,0,null,null,null,null,null,null,null,null,null,null,null,null,null,null,null,null,null,null,null,null,null,null,null,null,null,null,null,null,null,null,null,null,11920,0]
["0702004","Set de Exámenes por unidad transfundida de Plasma o de Plaquetas o de Crioprecipitados, c/u (incluye clasificación ABO y Rho, VDRL, HIV, virus hepatitis B antígeno de superficie, anticuerpos de hepatitis C, HTLV - I y II, Chagas)",0,0,null,null,null,null,null,null,null,null,null,null,null,null,null,null,null,null,null,null,null,null,null,null,null,null,null,null,null,null,null,null,null,null,9880,0]
["0702005","Prueba de compatibilidad por unidad de glóbulos rojos estudiada (proc. aut.)",0,0,null,null,null,null,null,null,null,null,null,null,null,null,null,null,null,null,null,null,null,null,null,null,null,null,null,null,null,null,null,null,null,null,1560,0]
["0702006","Transfusión en adulto (atención ambulatoria, atención cerrada siempre que la administración sea controlada por profesional especialista, tecnólogo médico o médico responsable) ",0,0,null,null,null,null,null,null,null,null,null,null,null,null,null,null,null,null,null,null,null,null,null,null,null,null,null,null,null,null,null,null,null,null,6160,0]
["0702007","Transfusión en niño (atención ambulatoria, atención cerrada siempre que la administración sea controlada por profesional especialista, tecnólogo médico o médico responsable) ",0,0,null,null,null,null,null,null,null,null,null,null,null,null,null,null,null,null,null,null,null,null,null,null,null,null,null,null,null,null,null,null,null,null,7140,0]
["0702008","Transfusión en adulto o niño en pabellón (con asistencia permanente del médico o tecnólogo médico responsable) (no corresponde su cobro cuando sea controlada por médico anestesista, por estar incluida en el valor de sus honorarios)",0,0,null,null,null,null,null,null,null,null,null,null,null,null,null,null,null,null,null,null,null,null,null,null,null,null,null,null,null,null,null,null,null,null,10530,0]
["0702009","Exsanguíneo transfusión en recién nacido por vía umbilical (incluye proc. completo de extracción y administración, además del set de exámenes previos a la transfusión)",0,0,null,null,null,null,null,null,null,null,null,null,null,null,null,null,null,null,null,null,null,null,null,null,null,null,null,null,null,null,null,null,null,null,47750,0]
["0702010","Exsanguíneo transfusión en adulto o niño (incluye proc. completo de extracción al receptor y administración al mismo, además del set de exámenes previos a la transfusión)",0,0,null,null,null,null,null,null,null,null,null,null,null,null,null,null,null,null,null,null,null,null,null,null,null,null,null,null,null,null,null,null,null,null,27510,0]
["0702011","Autotransfusión-Predepósito (incluye proc. completo, además de  los exámenes previos) (corresponde cobro de una prestación para extracción de 2 a 4 unidades de sangre o hemocomponentes) ",0,0,null,null,null,null,null,null,null,null,null,null,null,null,null,null,null,null,null,null,null,null,null,null,null,null,null,null,null,null,null,null,null,null,40170,0]
["0702012","Sangría (considera el cobro de una prestación por cada unidad de sangre extraída)",0,0,null,null,null,null,null,null,null,null,null,null,null,null,null,null,null,null,null,null,null,null,null,null,null,null,null,null,null,null,null,null,null,null,5720,0]
["0702013","Hemaféresis  procedimiento manual (incluye proc. completo)",0,0,null,null,null,null,null,null,null,null,null,null,null,null,null,null,null,null,null,null,null,null,null,null,null,null,null,null,null,null,null,null,null,null,18260,0]
["0702014","Hemaféresis procedimiento con máquina separadora celular  (incluye proc.  Completo)",0,0,null,null,null,null,null,null,null,null,null,null,null,null,null,null,null,null,null,null,null,null,null,null,null,null,null,null,null,null,null,null,null,null,196160,0]
[null,"TOTAL",{"$f":"SUM(C931:C944)","v":0},{"$f":"SUM(D931:D944)","v":0},{"$f":"SUM(E931:E944)","v":0},{"$f":"SUM(F931:F944)","v":0},{"$f":"SUM(G931:G944)","v":0},null,null,null,null,null,null,null,null,null,null,null,null,null,null,null,null,null,null,null,{"$f":"SUM(AA931:AA944)","v":0},0,0,{"$f":"SUM(AD931:AD944)","v":0},0,0,0,0,0,0,603560,0]
[null,"GRUPO 08 : ANATOMIA PATOLOGICA                                     "]
["0801001","Citodiagnóstico corriente, exfoliativa (Papanicolau y similares) (por cada órgano)",0,0,null,null,null,null,null,null,null,null,null,null,null,null,null,null,null,null,null,null,null,null,null,null,null,null,null,null,null,null,null,null,null,null,5260,{"$f":"AK947*E947","v":0}]
["0801002","Citología aspirativa (por punción); por cada órgano",0,0,null,null,null,null,null,null,null,null,null,null,null,null,null,null,null,null,null,null,null,null,null,null,null,null,null,null,null,null,null,null,null,null,7820,0]
["0801003","Estudio histopatológico con microscopía electrónica (por cada órgano)",0,0,null,null,null,null,null,null,null,null,null,null,null,null,null,null,null,null,null,null,null,null,null,null,null,null,null,null,null,null,null,null,null,null,24570,0]
["0801004","Estudio histopatológico con técnicas de inmunohistoquímica o inmunofluorescencia (por cada órgano)",0,0,null,null,null,null,null,null,null,null,null,null,null,null,null,null,null,null,null,null,null,null,null,null,null,null,null,null,null,null,null,null,null,null,21300,0]
["0801005","Estudio histopatológico con técnicas histoquímicas especiales (incluye descalcificación) (por cada órgano)",0,0,null,null,null,null,null,null,null,null,null,null,null,null,null,null,null,null,null,null,null,null,null,null,null,null,null,null,null,null,null,null,null,null,16010,0]
["0801006","Estudio histopatológico de biopsia  contemporánea (rápida) a intervenciones quirúrgicas (por cada órgano) (no incluye biopsia diferida)",0,0,null,null,null,null,null,null,null,null,null,null,null,null,null,null,null,null,null,null,null,null,null,null,null,null,null,null,null,null,null,null,null,null,21300,0]
["0801007","Estudio histopatológico con tinción corriente de biopsia diferida con estudio seriado (mínimo 10 muestras) de un órgano o parte de él (no incluye estudio con técnica habitual de otros órganos incluidos en la muestra)",0,0,null,null,null,null,null,null,null,null,null,null,null,null,null,null,null,null,null,null,null,null,null,null,null,null,null,null,null,null,null,null,null,null,21300,0]
["0801008","Estudio histopatológico corriente de biopsia diferida (por cada órgano)",0,0,null,null,null,null,null,null,null,null,null,null,null,null,null,null,null,null,null,null,null,null,null,null,null,null,null,null,null,null,null,null,null,null,10740,0]
["0801009","Necropsia de adulto o niño, con estudio histopatológico corriente",{"$f":"SUM(D955+G955)","v":0},{"$f":"SUM(E955:F955)","v":0},null,null,null,null,null,null,null,null,null,null,null,null,null,null,null,null,null,null,null,null,null,null,null,null,null,null,null,null,null,null,null,null,58590,0]
["0801010","Necropsia de feto o recién nacido, con estudio histopatológico corriente",0,0,null,null,null,null,null,null,null,null,null,null,null,null,null,null,null,null,null,null,null,null,null,null,null,null,null,null,null,null,null,null,null,null,46830,0]
[null,"TOTAL",{"$f":"SUM(C947:C956)","v":0},{"$f":"SUM(D947:D956)","v":0},{"$f":"SUM(E947:E956)","v":0},{"$f":"SUM(F947:F956)","v":0},{"$f":"SUM(G947:G956)","v":0},null,null,null,null,null,null,null,null,null,null,null,null,null,null,null,null,null,null,null,{"$f":"SUM(AA947:AA956)","v":0},0,0,{"$f":"SUM(AD947:AD956)","v":0},0,0,0,0,0,0,233720,0]
[null,"PSIQUIATRIA Y PSICOLOGIA CLINICA     "]
["0901001","Control paciente psiquiátrico crónico;máx.2 controles al mes",0,0]
["0901003","Electroshocks e insulino-terapia (efectuada y controlada por el médico psiquiatra, incluye trat. de las complicaciones médicas, c/s miorrelajantes); cada sesión (máx.6)",0,0]
["0901004","Prueba aversiva con disulfirano o similares (cualquiera) (máx. 1)",0,0]
["0901005","Atención psiquiátrica o psicoterapia de familia, individual, de relajación o de manejo (con familia u otros);(cada sesión mínimo 45')",0,0]
["0901006","Terapia aversiva con fármacos, c/sesión (máx. 15)",0,0]
["0901009","Evaluación psiquiátrica previa a terapia (1ra. consulta).",0,0]
["0901010","Psicoterapia de pareja (por cada miembro de la pareja)",0,0]
["0902001","Consulta Psicólogo clínico (sesiones 45')",0,0]
["0902002","Sesión de Psicoterapia individual",0,0]
["0902003","Sesión de psicoterapia de pareja (con ambos miembros)",0,0]
["0902010","Test de Rorschach",0,0]
["0902011","Test de relaciones objetales",0,0]
["0902012","Test de Apercepción Temática, T.A.T., C.A.T.-H o C.A.T.-A.",0,0]
["0902013","Test de Edwards",0,0]
["0902014","Test de M.M.P.I.",0,0]
["0902015","Test de Weschler, WAIS, WISC ó WPPSI",0,0]
["0902016","Test de Dominó o Test de Raven",0,0]
["0902017","Test de Bender",0,0]
["0902018","Bender Bip",0,0]
["0902019","Test de Goldstein",0,0]
["0902020","Test de Luria-Nebraska",0,0]
[null,"TOTAL",{"$f":"SUM(C959:C979)","v":0},{"$f":"SUM(D959:D979)","v":0},{"$f":"SUM(E959:E979)","v":0},{"$f":"SUM(F959:F979)","v":0},{"$f":"SUM(G959:G979)","v":0},null,null,null,null,null,null,null,null,null,null,null,null,null,null,null,null,null,null,null,{"$f":"SUM(AA959:AA979)","v":0},0,0,{"$f":"SUM(AD959:AD979)","v":0},0,0,0,0,0,0]
[null,"GRUPO 09 : PSIQUIATRIA Y SALUD MENTAL     "]
["0903001","Consulta de psiquiatría",0,0,null,null,null,null,null,null,null,null,null,null,null,null,null,null,null,null,null,null,null,null,null,null,null,null,null,null,null,null,null,null,null,null,7600,{"$f":"AK982*E982","v":0}]
["0903002","Consulta o control por psicólogo clínico",0,0,null,null,null,null,null,null,null,null,null,null,null,null,null,null,null,null,null,null,null,null,null,null,null,null,null,null,null,null,null,null,null,null,2980,0]
["0903003","Consulta de salud mental por otros profesionales",0,0,null,null,null,null,null,null,null,null,null,null,null,null,null,null,null,null,null,null,null,null,null,null,null,null,null,null,null,null,null,null,null,null,2980,0]
["0903004","Intervención psicosocial grupal (4 a 8 pacientes, familiares o cuidadores)",0,0,null,null,null,null,null,null,null,null,null,null,null,null,null,null,null,null,null,null,null,null,null,null,null,null,null,null,null,null,null,null,null,null,11850,0]
["0903005","Psicoterapia de grupo (por psicólogo o psiquiatra) (4 a 8 pacientes)",0,0,null,null,null,null,null,null,null,null,null,null,null,null,null,null,null,null,null,null,null,null,null,null,null,null,null,null,null,null,null,null,null,null,13870,0]
["0903006","Consultoría de salud mental por psiquiatra (sesión 4 hrs.) (mínimo 8 pacientes)",0,0,null,null,null,null,null,null,null,null,null,null,null,null,null,null,null,null,null,null,null,null,null,null,null,null,null,null,null,null,null,null,null,null,31480,0]
["0903007","Programa de rehabilitación tipo 1 (mensual, grupo 6 a 10 pers.)",0,0,null,null,null,null,null,null,null,null,null,null,null,null,null,null,null,null,null,null,null,null,null,null,null,null,null,null,null,null,null,null,null,null,4330,0]
["0903008","Programa de rehabilitación tipo 2 (mensual, grupo 5 a 7 pers.)",0,0,null,null,null,null,null,null,null,null,null,null,null,null,null,null,null,null,null,null,null,null,null,null,null,null,null,null,null,null,null,null,null,null,10170,0]
[null,"TOTAL",{"$f":"SUM(C982:C989)","v":0},{"$f":"SUM(D982:D989)","v":0},{"$f":"SUM(E982:E989)","v":0},{"$f":"SUM(F982:F989)","v":0},{"$f":"SUM(G982:G989)","v":0},null,null,null,null,null,null,null,null,null,null,null,null,null,null,null,null,null,null,null,{"$f":"SUM(AA982:AA989)","v":0},0,0,{"$f":"SUM(AD982:AD989)","v":0},0,0,0,0,0,0,85260,0]
["0901009","Evaluación psiquiátrica previa a terapia (1ra. consulta).",{"$f":"SUM(D991+G991)","v":0},{"$f":"SUM(E991+F991)","v":0}]
["0902001","Consulta Psicólogo clínico (sesiones 45')",{"$f":"SUM(D992+G992)","v":0},{"$f":"SUM(E992+F992)","v":0}]
["0901005","Atención psiquiátrica o psicoterapia de familia, individual, de relajación o de manejo (con familia u otros);(cada sesión mínimo 45')",0,0]
[null,"TOTAL ARANCEL MLE Y NO ARANCELADO",{"$f":"SUM(C991:C993)","v":0},{"$f":"SUM(D991:D993)","v":0},0,0,0]
[null,"TOTAL PRODUCCION"]
[null,"PROCEDIMIENTOS DIAGNOSTICOS NEUROLOGÍA                        "]
[1101004,"E.E.G. de 16 o más canales (incluye el cód. 11-01-006)",0,0,null,null,null,null,null,null,null,null,null,null,null,null,null,null,null,null,null,null,null,null,null,null,null,null,null,null,null,null,null,null,null,null,15710,{"$f":"AK997*E997","v":0}]
[1101006,"Electroencefalograma (E.E.G.) standard y/o activado \"sin privación de sueño\" (incluye mono y bipolares, hiperventilación, c/s reactividad auditiva, visual, lumínica, por drogas u otras). Equipo de 8 canales",0,0,null,null,null,null,null,null,null,null,null,null,null,null,null,null,null,null,null,null,null,null,null,null,null,null,null,null,null,null,null,null,null,null,12560,0]
[1101113,"Angiografía cerebral digital por cateterización (incluye proc. radiológico,  medio de contraste e insumos)",0,0,null,null,null,null,null,null,null,null,null,null,null,null,null,null,null,null,null,null,null,null,null,null,null,null,null,null,null,null,null,null,null,null,426120,0]
[1101140,"Esclerosis Múltiple Remitente Recurrente,  Tratamiento médico farmacológico  Anual (incluye inmunomoduladores)",0,0,null,null,null,null,null,null,null,null,null,null,null,null,null,null,null,null,null,null,null,null,null,null,null,null,null,null,null,null,null,null,null,null,9564730,0]
[1101141,"Esclerosis Múltiple Remitente Recurrente, Tratamiento rehabilitación",0,0,null,null,null,null,null,null,null,null,null,null,null,null,null,null,null,null,null,null,null,null,null,null,null,null,null,null,null,null,null,null,null,null,245530,0]
[1101142,"Esclerosis Múltiple Remitente Recurrente,  Tratamiento Brote",0,0,null,null,null,null,null,null,null,null,null,null,null,null,null,null,null,null,null,null,null,null,null,null,null,null,null,null,null,null,null,null,null,null,1119610,0]
[null,"TOTAL",{"$f":"SUM(C997:C1002)","v":0},{"$f":"SUM(D997:D1002)","v":0},{"$f":"SUM(E997:E1002)","v":0},{"$f":"SUM(F997:F1002)","v":0},{"$f":"SUM(G997:G1002)","v":0},null,null,null,null,null,null,null,null,null,null,null,null,null,null,null,null,null,null,null,{"$f":"SUM(AA997:AA1002)","v":0},0,0,0,0,0,0,0,0,0,11384260,0]
[null,"OTROS PROCEDIMIENTOS DIAGNOSTICOS   "]
[1101001,"Intraventricular por fontanela, cisternal o latero-cervical alta o de hematoma intracraneal",0,0]
[1101002,"Intraventricular por fontanela, cisternal o latero-cervical alta o de hematoma subdural",0,0]
[1101003,"Lumbar c/s manometria c/s queckensted   ",0,0]
[1101005,"Electrocorticografia",0,0]
[1101007,"Estereo-electroencefalografia (incluye uno o mas electrodos",0,0]
[1101008,"Monitoreo e.e.g. (electrodos implantados) por sesion.",0,0]
[1101040,"E.E.G. Post-privacion de sueno (incluye codigo 11-01-006). Equipo de 8 canales",0,0]
[1101041,"E.E.G. Post-privacion de sueno (incluye codigo 11-01-004) equipo de 16 o mas canales",0,0]
[1101042,"E.E.G. Digital (con activaciones) 20 canales",0,0]
[1101043,"E.E.G. Digital (con activaciones) 32 canales",0,0]
[1101046,"Electroencefalograma digital de 32 canales con \"mapeo\"",0,0]
[1101044,"Monitoreo e.e.g. Continuo de 24 hrs.",0,0]
[1101045,"Polisomnografia (estudio poligrafico del sueno),",0,0]
[1101009,"Electromiografia de fibra unica",0,0]
[1101010,"Electromiografias cualquier region, por ej.: musculos faciales, faringe, paravertebrales, vejiga y perone, test de miastenia (incluye el estudio clinico y muestreo suficiente para diagnosticar naturaleza del trastorno y estado evolutivo), c/u",0,0]
[1101011,"Potenciales evocados en corteza ( por ej.: auditivo, ocular",0,0]
[1101012,"Velocidad de conduccion (incluye reflejo h, onda f y otros)",0,0]
[1101013,"Carotida-vertebral por cateterizacion de la subclavia, axilar, humeral o femoral (a.c 04-02-029)",0,0]
[1101015,"Flebografia orbitaria ( a.c. 04-02-040 )",0,0]
[1101018,"Yugulografia ( a.c. 04-02-040 )",0,0]
[1101019,"Neumoencefalografia fraccionada, por puncion lumbar",{"$f":"SUM(D1025+G1025)","v":0},{"$f":"SUM(E1025:F1025)","v":0}]
[1101020,"Neumoencefalografia p/puncion suboccipital( a.c. 04-02-045 )",0,0]
[1101025,"Por puncion lumbar, con medio de contraste gaseoso o hidrosoluble (A.C. 04-02-049 O 04-02-050 S/corresp.)",0,0]
[1101026,"Infiltraciones de nervios perifericos intramuscular (de punto motor)",0,0]
[1101027,"Infiltraciones de nervios perifericos troncular",0,0]
[1101028,"Infiltraciones de ramas del trigemino o del facial",0,0]
[1101029,"Infiltraciones del ganglio estrellado",0,0]
[1101030,"Infiltraciones epidural, cervical, lumbar o similares, cada sesion",0,0]
[1101031,"Infiltraciones intercostales (cualquier numero)",0,0]
[1101032,"Rizotomia quimica por medio de inyeccion intratecal.",0,0]
[1101033,"Infiltraciones suboccipital u otros nervios cervicales",0,0]
[1101034,"Alcoholización o fenolización de nervios periféricos intramuscular",0,0]
[1101035,"Alcoholización o fenolización de nervios periféricos intratecal",0,0]
[1101036,"Alcoholización o fenolización de nervios periféricos troncular",0,0]
[1104100,"Embolizacion de malformaciones vasculares y otras terapias endovasculares cerebrales( exceptua tratamiento endovascular del aneurisma)",{"$f":"SUM(D1039+G1039)","v":0},{"$f":"SUM(E1039:F1039)","v":0}]
[1103000,"Tratamiento endovascular de aneurismas",0,0]
[1103100,"Tratamiento endovascular de aneurisma no roto de alta complejidad ( 6 o mas coils, , dos o más anurismas, utilizacion de stent + coils (uno o mas), embolizacion con coils asistida con balon)",0,0]
[5099018,"Inyeccion toxina botulinica",0,0]
[5099019,"Inyeccion interferon",0,0]
[5099113,"Infiltración  perineural",0,0]
[5099112,"Infiltración intramuscular (Fenol y Toxina Botulínica)",0,0]
[" 5099096 ","Neurologia-puncion lumbar ",0,0]
[null,"Implantación estimulador vagal epilepsia refractaria menores de 15 años",0,0]
[null,"Test de impulso cefálico",0,0]
[null,"Bloqueo neuromuscular con Toxina Butolínica",0,0]
[null,"Bloqueo neuromuscular con anestésico (manejo del dolor)",0,0]
[null,"Instalación cateter medición de presión líquido cefalo raquídeo",0,0]
[null,"Trombolisis de urgencia infarto cerebral",0,0]
[null,"Angiografía medular",0,0]
[null,"Embolización de Malformaciones arteriovenosas medulares",0,0]
[null,"Tratamiento endovascular infarto cerebral (ACV)",0,0]
[null,"Stent carotideo estenosis  carotidea cervical",0,0]
[null,"TOTAL",{"$f":"SUM(C1005:C1056)","v":0},{"$f":"SUM(D1005:D1056)","v":0},0,0,0,null,null,null,null,null,null,null,null,null,null,null,null,null,null,null,null,null,null,null,{"$f":"SUM(AA1005:AA1056)","v":0},0,0,0,0,0,0,0,0,0]
[null,"II.INTERVENCIONES QUIRURGICAS. NEUROCIRUGIA  "]
[1103001,"Aneurisma cirsoideo de cuero cabelludo, trat. quir.",{"$f":"SUM(I1059:N1059)","v":0},null,null,null,null,{"$f":"+I1059+J1059","v":0},null,null,null,null,null,null,{"$f":"SUM(P1059:Q1059)","v":0},null,null,{"$f":"SUM(S1059:T1059)","v":0},null,null,{"$f":"SUM(V1059:W1059)","v":0},null,null,{"$f":"SUM(Y1059:Z1059)","v":0},null,null,null,null,null,null,null,null,null,null,null,null,158730,{"$f":"AK1059*I1059","v":0}]
[1103002,"Sinus pericrani, trat. quir.",{"$f":"SUM(I1060:N1060)","v":0},null,null,null,null,{"$f":"+I1060+J1060","v":0},null,null,null,null,null,null,{"$f":"SUM(P1060:Q1060)","v":0},null,null,{"$f":"SUM(S1060:T1060)","v":0},null,null,{"$f":"SUM(V1060:W1060)","v":0},null,null,{"$f":"SUM(Y1060:Z1060)","v":0},null,null,null,null,null,null,null,null,null,null,null,null,158730,0]
[1103003,"Hundimiento simple, reparación de",0,null,null,null,null,0,null,null,null,null,null,null,0,null,null,0,null,null,0,null,null,0,null,null,null,null,null,null,null,null,null,null,null,null,198060,0]
[1103004,"Craneoplastía con autoinjerto",0,null,null,null,null,0,null,null,null,null,null,null,0,null,null,0,null,null,0,null,null,0,null,null,null,null,null,null,null,null,null,null,null,null,379890,0]
[1103005,"Craneoplastía con prótesis (no incluye valor de la prótesis)",0,null,null,null,null,0,null,null,null,null,null,null,0,null,null,0,null,null,0,null,null,0,null,null,null,null,null,null,null,null,null,null,null,null,215950,0]
[1103006,"Tumores de calota, extirp. de",0,null,null,null,null,0,null,null,null,null,null,null,0,null,null,0,null,null,0,null,null,0,null,null,null,null,null,null,null,null,null,null,null,null,216230,0]
[1103007,"Osteomielitis, limpieza quirúrgica",0,null,null,null,null,0,null,null,null,null,null,null,0,null,null,0,null,null,0,null,null,0,null,null,null,null,null,null,null,null,null,null,null,null,198340,0]
[1103008,"Craniectomías descompresivas",0,null,null,null,null,0,null,null,null,null,null,null,0,null,null,0,null,null,0,null,null,0,null,null,null,null,null,null,null,null,null,null,null,null,243350,0]
[1103009,"Reparación de fractura crecedora",0,null,null,null,null,0,null,null,null,null,null,null,0,null,null,0,null,null,0,null,null,0,null,null,null,null,null,null,null,null,null,null,null,null,333750,0]
[1103010,"Craneotomías lineales",0,null,null,null,null,0,null,null,null,null,null,null,0,null,null,0,null,null,0,null,null,0,null,null,null,null,null,null,null,null,null,null,null,null,396550,0]
[1103011,"Craniectomías c/s remodelación ósea",0,null,null,null,null,0,null,null,null,null,null,null,0,null,null,0,null,null,0,null,null,0,null,null,null,null,null,null,null,null,null,null,null,null,608860,0]
[1103012,"Honorarios del 1er. cirujano responsable y sus ayudantes",0,null,null,null,null,0,null,null,null,null,null,null,0,null,null,0,null,null,0,null,null,0,null,null,null,null,null,null,null,null,null,null,null,null,654950,0]
[1103013,"Honorarios c/u de los otros 1ros. cirujanos y ayudantes",0,null,null,null,null,0,null,null,null,null,null,null,0,null,null,0,null,null,0,null,null,0,null,null,null,null,null,null,null,null,null,null,null,null,294140,0]
[1103014,"Hematoma o absceso extradural, vaciamiento de",0,null,null,null,null,0,null,null,null,null,null,null,0,null,null,0,null,null,0,null,null,0,null,null,null,null,null,null,null,null,null,null,null,null,370370,0]
[1103015,"Reparación de fístula de LCR",0,null,null,null,null,0,null,null,null,null,null,null,0,null,null,0,null,null,0,null,null,0,null,null,null,null,null,null,null,null,null,null,null,null,413640,0]
[1103016,"Hematoma, empiema o colección subdural, vaciamiento de",0,null,null,null,null,0,null,null,null,null,null,null,0,null,null,0,null,null,0,null,null,0,null,null,null,null,null,null,null,null,null,null,null,null,370370,0]
[1103017,"Quistes aracnoidales encefálicos, trat. quir. (suprasellares, temporales, cerebelosos, etc.)",0,null,null,null,null,0,null,null,null,null,null,null,0,null,null,0,null,null,0,null,null,0,null,null,null,null,null,null,null,null,null,null,null,null,414990,0]
[1103018,"Ventriculostomía o instalación de derivativa ventricular externa o instalación de captor para medición de pic o punción biopsia o reservorio para administración de medicamentos",0,null,null,null,null,0,null,null,null,null,null,null,0,null,null,0,null,null,0,null,null,0,null,null,null,null,null,null,null,null,null,null,null,null,198340,0]
[1103019,"Absceso cerebral, trat. quir.",0,null,null,null,null,0,null,null,null,null,null,null,0,null,null,0,null,null,0,null,null,0,null,null,null,null,null,null,null,null,null,null,null,null,517400,0]
[1103020,"Tratamiento quirúrgico del traumatismo craneoencefálico  abierto o penetrante (herida a bala u otro elemento penetrante)",0,null,null,null,null,0,null,null,null,null,null,null,0,null,null,0,null,null,0,null,null,0,null,null,null,null,null,null,null,null,null,null,null,null,327330,0]
[1103021,"Hundimiento expuesto, repar. de",0,null,null,null,null,0,null,null,null,null,null,null,0,null,null,0,null,null,0,null,null,0,null,null,null,null,null,null,null,null,null,null,null,null,261210,0]
[1103022,"Lobectomías por contusión cerebral",0,null,null,null,null,0,null,null,null,null,null,null,0,null,null,0,null,null,0,null,null,0,null,null,null,null,null,null,null,null,null,null,null,null,462310,0]
[1103023,"Hematoma intracerebral, vaciamiento de",0,null,null,null,null,0,null,null,null,null,null,null,0,null,null,0,null,null,0,null,null,0,null,null,null,null,null,null,null,null,null,null,null,null,436340,0]
[1103024,"De base de cráneo",0,null,null,null,null,0,null,null,null,null,null,null,0,null,null,0,null,null,0,null,null,0,null,null,null,null,null,null,null,null,null,null,null,null,894700,0]
[1103025,"Intraorbitarios",0,null,null,null,null,0,null,null,null,null,null,null,0,null,null,0,null,null,0,null,null,0,null,null,null,null,null,null,null,null,null,null,null,null,894700,0]
[1103026,"Encefálicos y de hipófisis",0,null,null,null,null,0,null,null,null,null,null,null,0,null,null,0,null,null,0,null,null,0,null,null,null,null,null,null,null,null,null,null,null,null,894700,0]
[1103027,"Aneurismas, malformaciones arteriovenosas encefálicas u orbitarias, fístulas durales",0,null,null,null,null,0,null,null,null,null,null,null,0,null,null,0,null,null,0,null,null,0,null,null,null,null,null,null,null,null,null,null,null,null,967970,0]
[1103028,"Fístula carótido cavernosa tratamiento endovascular",0,null,null,null,null,0,null,null,null,null,null,null,0,null,null,0,null,null,0,null,null,0,null,null,null,null,null,null,null,null,null,null,null,null,341730,0]
[1103029,"Fístula carótido cavernosa, trat. quir.",0,null,null,null,null,0,null,null,null,null,null,null,0,null,null,0,null,null,0,null,null,0,null,null,null,null,null,null,null,null,null,null,null,null,464920,0]
[1103030,"Revascularización intracraneana indirecta (endodurosinangiosis, multitrepanación, emás, etc)",0,null,null,null,null,0,null,null,null,null,null,null,0,null,null,0,null,null,0,null,null,0,null,null,null,null,null,null,null,null,null,null,null,null,370370,0]
[1103031,"Anastomosis y revascularización cerebral extra-intracraneana (cirugía de carótida: ver Cirugía Vascular Periférica)",0,null,null,null,null,0,null,null,null,null,null,null,0,null,null,0,null,null,0,null,null,0,null,null,null,null,null,null,null,null,null,null,null,null,694080,0]
[1103032,"Instalación de derivativas de LCR (no incluye valor de la válvula)",0,null,null,null,null,0,null,null,null,null,null,null,0,null,null,0,null,null,0,null,null,0,null,null,null,null,null,null,null,null,null,null,null,null,306580,0]
[1103132,"Instalación de derivativas de LCR (incluye valor de la válvula)",0,null,null,null,null,0,null,null,null,null,null,null,0,null,null,0,null,null,0,null,null,0,null,null,null,null,null,null,null,null,null,null,null,null,741500,{"$f":"AK1091*I1091","v":0}]
[1103033,"Revisión o exteriorización de derivativa",0,null,null,null,null,0,null,null,null,null,null,null,0,null,null,0,null,null,0,null,null,0,null,null,null,null,null,null,null,null,null,null,null,null,159020,0]
[1103034,"Ventriculocisternostomía",0,null,null,null,null,0,null,null,null,null,null,null,0,null,null,0,null,null,0,null,null,0,null,null,null,null,null,null,null,null,null,null,null,null,287220,0]
[1103035,"Fenestración, septostomía o coagulación plexos coroídeos (trat. endoscópico)",0,null,null,null,null,0,null,null,null,null,null,null,0,null,null,0,null,null,0,null,null,0,null,null,null,null,null,null,null,null,null,null,null,null,337620,0]
[1103036,"Cirugía descompresiva de fosa posterior u occipito-vertebral en Malformación de Chiari y/o siringomielia",0,null,null,null,null,0,null,null,null,null,null,null,0,null,null,0,null,null,0,null,null,0,null,null,null,null,null,null,null,null,null,null,null,null,467560,0]
[1103037,"Meningo y meningoencefalocele occipital, repar. de",0,null,null,null,null,0,null,null,null,null,null,null,0,null,null,0,null,null,0,null,null,0,null,null,null,null,null,null,null,null,null,null,null,null,656770,0]
[1103038,"Cirugía descompresiva neurovascular",0,null,null,null,null,0,null,null,null,null,null,null,0,null,null,0,null,null,0,null,null,0,null,null,null,null,null,null,null,null,null,null,null,null,523660,0]
[1103039,"Neurotomías",0,null,null,null,null,0,null,null,null,null,null,null,0,null,null,0,null,null,0,null,null,0,null,null,null,null,null,null,null,null,null,null,null,null,188920,0]
[1103040,"Neurolisis o microcompresión percutánea",0,null,null,null,null,0,null,null,null,null,null,null,0,null,null,0,null,null,0,null,null,0,null,null,null,null,null,null,null,null,null,null,null,null,229990,0]
[1103041,"Cirugía de la epilepsia (cualquier técnica)",0,null,null,null,null,0,null,null,null,null,null,null,0,null,null,0,null,null,0,null,null,0,null,null,null,null,null,null,null,null,null,null,null,null,467560,0]
[1103042,"Biopsia estereotáxica cerebral con marco de estereotaxia o neuronavegador",0,null,null,null,null,0,null,null,null,null,null,null,0,null,null,0,null,null,0,null,null,0,null,null,null,null,null,null,null,null,null,null,null,null,509130,0]
[1103043,"Coagulación de núcleos o vías encefálicas",0,null,null,null,null,0,null,null,null,null,null,null,0,null,null,0,null,null,0,null,null,0,null,null,null,null,null,null,null,null,null,null,null,null,606600,0]
[1103044,"Implantación de isótopos (braquiterapia) (no incluye valor del radiofármaco)",0,null,null,null,null,0,null,null,null,null,null,null,0,null,null,0,null,null,0,null,null,0,null,null,null,null,null,null,null,null,null,null,null,null,509130,0]
[1103045,"Implantación de estimuladores intracraneanos",0,null,null,null,null,0,null,null,null,null,null,null,0,null,null,0,null,null,0,null,null,0,null,null,null,null,null,null,null,null,null,null,null,null,441530,0]
[1103046,"Instalación de estimuladores medulares",0,null,null,null,null,0,null,null,null,null,null,null,0,null,null,0,null,null,0,null,null,0,null,null,null,null,null,null,null,null,null,null,null,null,309180,0]
[1103047,"Disrafias espinales: meningocele, mielomeningocele, diastematomielia, lipoma, lipomeningocele, médula anclada, etc.",0,null,null,null,null,0,null,null,null,null,null,null,0,null,null,0,null,null,0,null,null,0,null,null,null,null,null,null,null,null,null,null,null,null,656770,0]
[1103048,"Infiltracion facetaria columna y radicular",0,null,null,null,null,0,null,null,null,null,null,null,0,null,null,0,null,null,0,null,null,0,null,null,null,null,null,null,null,null,null,null,null,null,188920,0]
[1103049,"Hernia núcleo pulposo, estenorraquis, aracnoiditis, fibrosis perirradicular cervical, dorsal o lumbar, trat. quir.",0,null,null,null,null,0,null,null,null,null,null,null,0,null,null,0,null,null,0,null,null,0,null,null,null,null,null,null,null,null,null,null,null,null,564510,0]
[1103050,"Laminectomía descompresiva",0,null,null,null,null,0,null,null,null,null,null,null,0,null,null,0,null,null,0,null,null,0,null,null,null,null,null,null,null,null,null,null,null,null,433910,0]
[1103069,"Fijación de columna (cervical – dorsal – lumbar) cualquier vía abordaje, c/s osteosíntesis",0,null,null,null,null,0,null,null,null,null,null,null,0,null,null,0,null,null,0,null,null,0,null,null,null,null,null,null,null,null,null,null,null,null,426950,0]
[1103051,"Heridas raquimedulares, trat. quir.",0,null,null,null,null,0,null,null,null,null,null,null,0,null,null,0,null,null,0,null,null,0,null,null,null,null,null,null,null,null,null,null,null,null,336890,0]
[1103052,"Tratamiento quirúrgico de tumor espinal extradural",0,null,null,null,null,0,null,null,null,null,null,null,0,null,null,0,null,null,0,null,null,0,null,null,null,null,null,null,null,null,null,null,null,null,370370,0]
[1103053,"Extirpación de tumor o quiste medular o intrarraquideo",0,null,null,null,null,0,null,null,null,null,null,null,0,null,null,0,null,null,0,null,null,0,null,null,null,null,null,null,null,null,null,null,null,null,476860,0]
[1103054,"Malformación arteriovenosa o fístula dural medular, trat. quir.",0,null,null,null,null,0,null,null,null,null,null,null,0,null,null,0,null,null,0,null,null,0,null,null,null,null,null,null,null,null,null,null,null,null,541290,0]
[1103055,"Cordotomía percutánea",0,null,null,null,null,0,null,null,null,null,null,null,0,null,null,0,null,null,0,null,null,0,null,null,null,null,null,null,null,null,null,null,null,null,239340,0]
[1103056,"Mielotomía, DREZtomía",0,null,null,null,null,0,null,null,null,null,null,null,0,null,null,0,null,null,0,null,null,0,null,null,null,null,null,null,null,null,null,null,null,null,394050,0]
[1103057,"Rizotomía (cualquier técnica)",0,null,null,null,null,0,null,null,null,null,null,null,0,null,null,0,null,null,0,null,null,0,null,null,null,null,null,null,null,null,null,null,null,null,309360,0]
[1103058,"Tumor de nervio periférico, extirp. de",0,null,null,null,null,0,null,null,null,null,null,null,0,null,null,0,null,null,0,null,null,0,null,null,null,null,null,null,null,null,null,null,null,null,164540,0]
[1103059,"Reparación de plexos c/s neurotización con técnica microquirúrgica o injertos interfasciculares",0,null,null,null,null,0,null,null,null,null,null,null,0,null,null,0,null,null,0,null,null,0,null,null,null,null,null,null,null,null,null,null,null,null,453470,0]
[1103060,"Sección de nervio, reparación con injerto",0,null,null,null,null,0,null,null,null,null,null,null,0,null,null,0,null,null,0,null,null,0,null,null,null,null,null,null,null,null,null,null,null,null,282000,0]
[1103061,"Sección de nervio, reparación sin injerto",0,null,null,null,null,0,null,null,null,null,null,null,0,null,null,0,null,null,0,null,null,0,null,null,null,null,null,null,null,null,null,null,null,null,219790,0]
[1103068,"Neurectomía, cualquier localización, cada zona quirúrgica",0,null,null,null,null,0,null,null,null,null,null,null,0,null,null,0,null,null,0,null,null,0,null,null,null,null,null,null,null,null,null,null,null,null,154710,0]
[1103062,"Neurolisis con técnica microquirúrgica",0,null,null,null,null,0,null,null,null,null,null,null,0,null,null,0,null,null,0,null,null,0,null,null,null,null,null,null,null,null,null,null,null,null,282000,{"$f":"AK1123*I1123","v":0}]
[1103063,"Neurolisis externa",{"$f":"SUM(I1124:N1124)","v":0},null,null,null,null,{"$f":"+I1124+J1124","v":0},null,null,null,null,null,null,{"$f":"SUM(P1124:Q1124)","v":0},null,null,{"$f":"SUM(S1124:T1124)","v":0},null,null,{"$f":"SUM(V1124:W1124)","v":0},null,null,{"$f":"SUM(Y1124:Z1124)","v":0},null,null,null,null,null,null,null,null,null,null,null,null,152020,0]
[1103064,"Síndrome del escaleno, trat. quir.",{"$f":"SUM(I1125:N1125)","v":0},null,null,null,null,0,null,null,null,null,null,null,{"$f":"SUM(P1125:Q1125)","v":0},null,null,{"$f":"SUM(S1125:T1125)","v":0},null,null,{"$f":"SUM(V1125:W1125)","v":0},null,null,{"$f":"SUM(Y1125:Z1125)","v":0},null,null,null,null,null,null,null,null,null,null,null,null,213000,0]
[1103065,"Síndrome de costilla cervical, trat. quir.",{"$f":"SUM(I1126:N1126)","v":0},null,null,null,null,0,null,null,null,null,null,null,{"$f":"SUM(P1126:Q1126)","v":0},null,null,{"$f":"SUM(S1126:T1126)","v":0},null,null,{"$f":"SUM(V1126:W1126)","v":0},null,null,{"$f":"SUM(Y1126:Z1126)","v":0},null,null,null,null,null,null,null,null,null,null,null,null,312280,0]
[1103066,"Liberación quirúrgica de nervio periférico extracraneano (trat. quir. del Síndrome del Túnel Carpiano, tarso u otro)",{"$f":"SUM(I1127:N1127)","v":0},null,null,null,null,0,null,null,null,null,null,null,{"$f":"SUM(P1127:Q1127)","v":0},null,null,{"$f":"SUM(S1127:T1127)","v":0},null,null,{"$f":"SUM(V1127:W1127)","v":0},null,null,{"$f":"SUM(Y1127:Z1127)","v":0},null,null,null,null,null,null,null,null,null,null,null,null,164540,0]
[1103067,"Liberación de nervio cubital a nivel del codo, cualquier técnica",{"$f":"SUM(I1128:N1128)","v":0},null,null,null,null,0,null,null,null,null,null,null,{"$f":"SUM(P1128:Q1128)","v":0},null,null,{"$f":"SUM(S1128:T1128)","v":0},null,null,{"$f":"SUM(V1128:W1128)","v":0},null,null,{"$f":"SUM(Y1128:Z1128)","v":0},null,null,null,null,null,null,null,null,null,null,null,null,183230,0]
[null,"TOTAL",{"$f":"SUM(C1059:C1128)","v":0},null,null,null,null,{"$f":"SUM(H1059:H1128)","v":0},{"$f":"SUM(I1059:I1128)","v":0},0,0,0,0,0,0,0,0,0,0,0,0,0,0,0,0,0,0,0,0,0,0,0,0,0,0,0,27615770,0]
[" ","PROCEDIMIENTOS DE OFTALMOLOGÍA"]
[1201001,"Campimetria de proyeccion, c/ojo (proc.aut.)",{"$f":"SUM(D1131+G1131)","v":0},{"$f":"SUM(E1131:F1131)","v":0}]
[1201042,"Campimetria computarizada, c/ojo",0,0]
[1201002,"Coordimetria, test de hess u otro, c/ojo",0,0]
[1201003,"Cuantificacion de lagrimacion (test de   schirmer),  uno o                  ",0,0]
[1201004,"Curva de tension aplanatica (por cada dia), c/ojo                                ",0,0]
[1201005,"Diploscopia cuantitativa, ambos ojos                                                      ",0,0]
[1201006,"Electromiografia musculos oculares adultos, c/ojo",0,0]
[1201007,"Electromiografia musculos oculares ninos, c/ojo",0,0]
[1201008,"Electrooculografia, ambos ojos",0,0]
[1201009,"Exploracion sensoriomotora: estrabismo, estudio completo ,               ",0,0]
[1201010,"Perimetria estatica (con campimetria de  proyeccion) ,",0,0]
[1201011,"Pruebas de provocacion para glaucoma (prueba de oscuridad",0,0]
[1201012,"Retinografia, ambos ojos                                                                           ",0,0]
[1201013,"Tonografia electronica, c/ojo",0,0]
[1201014,"Tonometria ocular, cualquier tecnica, c/ojo                                            ",0,0]
[1201015,"Tratamiento ortoptico y/ o pleoptico (por sesion) ,                               ",0,0]
[1201016,"Angiografia de retina o de iris, (con fluoresceina o",0,0]
[1201017,"Angioscopia retinal y/o iris (con fluoresceina o similar),",0,0]
[1201018,"Electrorretinografia, c/ojo",0,0]
[1201019,"Exploracion vitreorretinal, ambos ojos                                                       ",0,0]
[1201020,"Ecobiometria con calculo de lente intraocular, ambos ojos.",0,0]
[1201023,"Potencial visual evocado en adultos, ambos ojos",0,0]
[1201024,"Potencial visual evocado en ninos, ambos ojos",0,0]
[1201027,"Examen Optométrico c/s Prescripción de Lentes   ",0,0]
[1201043,"Topografia corneal computarizada, c/ojo",0,0]
[1201028,"Flebografia orbitaria (a.c. 04-02-040)",{"$f":"SUM(D1156+G1156)","v":0},{"$f":"SUM(E1156:F1156)","v":0}]
[1201029,"Cuerpo extrano conjuntival y/o corneal en adultos                                 ",0,0]
[1201030,"Cuerpo extrano conjuntival y/o corneal en ninos",0,0]
[1201031,"Via lagrimal,cateterismo o sondaje en adultos",0,0]
[1201032,"Via lagrimal, cateterismo o sondaje en lactantes",0,0]
[1201033,"Via lagrimal, cateterismo o sondaje en ninos",0,0]
[1201034,"Tocacion corneal c/yodo y/o eter u otros, en ninos o adultos",0,0]
[1201035,"Criocoagulacion conjuntival, corneal o palpebral en adultos",0,0]
[1201036,"Criocoagulacion conjuntival, corneal o palpebral en ninos",0,0]
[1201037,"Glaucoma, ciclodiatermia y/o ciclocrioterapia",0,0]
[1201038,"Inyeccion retrobulbar",0,0]
[1201039,"Pestanas, extirp. Por electrocoagulacion (cualquier numero)",0,0]
[1201040,"Puntos lagrimales; electrotermocoagulacion",0,0]
[1201041,"Sondaje vía lagrimal en niños (bajo anestesia general)",0,0]
[1201042,"Campimetría computarizada, c/ojo (excluye UAPO)                            ",0,0]
[1201042,"Campimetría computarizada, c/ojo (en UAPO)                                  ",0,0]
[5099012,"Tomografia coherencia optica",0,0]
[5099013,"Inyeccion intravitrea  avastin",0,0]
[5099014,"Toma agudeza visual (ambos ojos)",0,0]
[5099015,"Autorefractometria",0,0]
[5099016,"Lensometria",0,0]
[5099049,"Tomografia de coherencia optica",0,0]
[5099050,"Campimetria de goldman",0,0]
[5099051,"Test de ishihara",0,0]
[5099052,"Campo visual",0,0]
[5099001,"Paquimetría ultrasónica",0,0]
[5099002,"Paquimetría optica",0,0]
[null,"Tensión ocular",0,0]
[null,"Biomicroscopía ocular",0,0]
[null,"Examen de visión cromática",0,0]
[null,"TOTAL ",{"$f":"SUM(C1131:C1185)","v":0},0,0,0,0,null,null,null,null,null,null,null,null,null,null,null,null,null,null,null,null,null,null,null,0,0,0,0,0,0,0,0,0,0]
[null,"GRUPO 12 : CIRUGIA OFTALMOLOGICA          "]
[1202001,"Intubación lagrimal",{"$f":"SUM(I1188:N1188)","v":0},null,null,null,null,{"$f":"+I1188+J1188","v":0},null,null,null,null,null,null,null,null,null,null,null,null,null,null,null,null,null,null,null,null,null,null,null,null,null,null,null,null,35020,{"$f":"AK1188*I1188","v":0}]
[1202002,"Puntos lagrimales, plastía de",{"$f":"SUM(I1189:N1189)","v":0},null,null,null,null,0,null,null,null,null,null,null,null,null,null,null,null,null,null,null,null,null,null,null,null,null,null,null,null,null,null,null,null,null,31220,0]
[1202003,"Reconstitución de canalículos",0,null,null,null,null,0,null,null,null,null,null,null,null,null,null,null,null,null,null,null,null,null,null,null,null,null,null,null,null,null,null,null,null,null,72720,0]
[1202004,"Absceso, vaciamiento y/o drenaje de",0,null,null,null,null,0,null,null,null,null,null,null,null,null,null,null,null,null,null,null,null,null,null,null,null,null,null,null,null,null,null,null,null,null,16520,0]
[1202005,"Dacriocistorrinostomía",0,null,null,null,null,0,null,null,null,null,null,null,null,null,null,null,null,null,null,null,null,null,null,null,null,null,null,null,null,null,null,null,null,null,96360,0]
[1202006,"Extirpación de lagrimal",0,null,null,null,null,0,null,null,null,null,null,null,null,null,null,null,null,null,null,null,null,null,null,null,null,null,null,null,null,null,null,null,null,null,43530,0]
[1202007,"Reconstitución vía lagrimal en ausencia del saco",0,null,null,null,null,0,null,null,null,null,null,null,{"$f":"SUM(P1194:Q1194)","v":4},2,2,{"$f":"SUM(S1194:T1194)","v":4},2,2,{"$f":"SUM(V1194:W1194)","v":0},null,null,{"$f":"SUM(Y1194:Z1194)","v":0},null,null,null,null,null,null,null,null,null,null,null,null,138100,0]
[1202008,"Extirpación total o parcial de la glándula lagrimal ",0,null,null,null,null,0,null,null,null,null,null,null,4,2,2,4,2,2,0,null,null,0,null,null,null,null,null,null,null,null,null,null,null,null,135970,0]
[1202009,"Tumor maligno  del saco, trat. quir. completo",0,null,null,null,null,0,null,null,null,null,null,null,4,2,2,4,2,2,0,null,null,0,null,null,null,null,null,null,null,null,null,null,null,null,109820,0]
[1202010,"Absceso lagrimal, trat. quir.",0,null,null,null,null,0,null,null,null,null,null,null,null,null,null,null,null,null,null,null,null,null,null,null,null,null,null,null,null,null,null,null,null,null,16520,0]
[1202011,"Biopsia de párpado y/o anexos (proc. aut.)",0,null,null,null,null,0,null,null,null,null,null,null,null,null,null,null,null,null,null,null,null,null,null,null,null,null,null,null,null,null,null,null,null,null,22750,0]
[1202012,"Blefarochalasis, plastía de",0,null,null,null,null,0,null,null,null,null,null,null,null,null,null,null,null,null,null,null,null,null,null,null,null,null,null,null,null,null,null,null,null,null,42580,0]
[1202013,"Blefarofimosis, plastía de",0,null,null,null,null,0,null,null,null,null,null,null,0,null,null,0,null,null,0,null,null,0,null,null,null,null,null,null,null,null,null,null,null,null,87460,0]
[1202014,"Blefarorrafia con blefarotomía posterior",0,null,null,null,null,0,null,null,null,null,null,null,null,null,null,null,null,null,null,null,null,null,null,null,null,null,null,null,null,null,null,null,null,null,26010,0]
[1202015,"Cantoplastía",0,null,null,null,null,0,null,null,null,null,null,null,null,null,null,null,null,null,null,null,null,null,null,null,null,null,null,null,null,null,null,null,null,null,34270,0]
[1202016,"Chalazión y otros tumores benignos (uno o más en el mismo ojo), trat. quir. Completo",0,null,null,null,null,0,null,null,null,null,null,null,null,null,null,null,null,null,null,null,null,null,null,null,null,null,null,null,null,null,null,null,null,null,28160,0]
[1202017,"Plastía de Coloboma",0,null,null,null,null,0,null,null,null,null,null,null,0,null,null,0,null,null,0,null,null,0,null,null,null,null,null,null,null,null,null,null,null,null,91850,0]
[1202018,"Plastía de Ectropión",0,null,null,null,null,0,null,null,null,null,null,null,null,null,null,null,null,null,null,null,null,null,null,null,null,null,null,null,null,null,null,null,null,null,55510,0]
[1202019,"Plastía de Entropión",0,null,null,null,null,0,null,null,null,null,null,null,null,null,null,null,null,null,null,null,null,null,null,null,null,null,null,null,null,null,null,null,null,null,55510,0]
[1202020,"Plastía de Epicanto",0,null,null,null,null,0,null,null,null,null,null,null,null,null,null,null,null,null,null,null,null,null,null,null,null,null,null,null,null,null,null,null,null,null,55510,0]
[1202021,"Ptosis, trat. quir.",0,null,null,null,null,0,null,null,null,null,null,null,0,null,null,0,null,null,0,null,null,0,null,null,null,null,null,null,null,null,null,null,null,null,88460,0]
[1202022,"Quiste dermoide de la cola de la ceja, resec. plástica",0,null,null,null,null,0,null,null,null,null,null,null,null,null,null,null,null,null,null,null,null,null,null,null,null,null,null,null,null,null,null,null,null,null,28780,0]
[1202023,"Tumor maligno, trat. quir. completo",0,null,null,null,null,0,null,null,null,null,null,null,0,null,null,0,null,null,0,null,null,0,null,null,null,null,null,null,null,null,null,null,null,null,78600,0]
[1202024,"Xantelasma, trat. quir.",0,null,null,null,null,0,null,null,null,null,null,null,null,null,null,null,null,null,null,null,null,null,null,null,null,null,null,null,null,null,null,null,null,null,23560,0]
[1202071,"Herida o dehiscencia de sutura de párpado, reparación",0,null,null,null,null,0,null,null,null,null,null,null,null,null,null,null,null,null,null,null,null,null,null,null,null,null,null,null,null,null,null,null,null,null,33230,0]
[1202025,"Herida o dehiscencia, sutura de (proc. aut.)",0,null,null,null,null,0,null,null,null,null,null,null,null,null,null,null,null,null,null,null,null,null,null,null,null,null,null,null,null,null,null,null,null,null,47770,0]
[1202026,"Pterigión y/o pseudopterigión o su recidiva, extirpación",0,null,null,null,null,0,null,null,null,null,null,null,null,null,null,null,null,null,null,null,null,null,null,null,null,null,null,null,null,null,null,null,null,null,54860,0]
[1202027,"Simbléfaron, resección de adherencias y plastía de",0,null,null,null,null,0,null,null,null,null,null,null,0,null,null,0,null,null,0,null,null,0,null,null,null,null,null,null,null,null,null,null,null,null,54020,0]
[1202028,"Tumor benigno, extirp. de",0,null,null,null,null,0,null,null,null,null,null,null,null,null,null,null,null,null,null,null,null,null,null,null,null,null,null,null,null,null,null,null,null,null,33330,0]
[1202029,"Absceso párpado, trat. quir.",0,null,null,null,null,0,null,null,null,null,null,null,null,null,null,null,null,null,null,null,null,null,null,null,null,null,null,null,null,null,null,null,null,null,31790,0]
[1202030,"Corrección de cavidad anoftálmica trat. completo",0,null,null,null,null,0,null,null,null,null,null,null,0,null,null,0,null,null,0,null,null,0,null,null,null,null,null,null,null,null,null,null,null,null,141790,0]
[1202031,"Cuerpo extraño orbitario (con orbitotomía)",0,null,null,null,null,0,null,null,null,null,null,null,0,null,null,0,null,null,0,null,null,0,null,null,null,null,null,null,null,null,null,null,null,null,157970,0]
[1202032,"Exanteración orbitaria o tumor orbitario, trat. quirúrgico completo",0,null,null,null,null,0,null,null,null,null,null,null,0,null,null,0,null,null,0,null,null,0,null,null,null,null,null,null,null,null,null,null,null,null,296750,{"$f":"AK1220*I1220","v":0}]
[1202033,"Orbitotomía anterior",0,null,null,null,null,0,null,null,null,null,null,null,0,null,null,0,null,null,0,null,null,0,null,null,null,null,null,null,null,null,null,null,null,null,68330,0]
[1202034,"Orbitotomía lateral descompresiva",0,null,null,null,null,0,null,null,null,null,null,null,0,null,null,0,null,null,0,null,null,0,null,null,null,null,null,null,null,null,null,null,null,null,100700,0]
[1202072,"Reconstruccion de paredes orbitarias.",0,null,null,null,null,0,null,null,null,null,null,null,0,null,null,0,null,null,0,null,null,0,null,null,null,null,null,null,null,null,null,null,null,null,94010,0]
[1202035,"Biopsia de globo ocular (proc. aut.)",0,null,null,null,null,0,null,null,null,null,null,null,0,null,null,0,null,null,0,null,null,0,null,null,null,null,null,null,null,null,null,null,null,null,50950,0]
[1202036,"Enucleación o implante de prótesis ocular (proc. aut.)",0,null,null,null,null,0,null,null,null,null,null,null,0,null,null,0,null,null,0,null,null,0,null,null,null,null,null,null,null,null,null,null,null,null,118720,0]
[1202037,"Enucleación con implante",0,null,null,null,null,0,null,null,null,null,null,null,0,null,null,0,null,null,0,null,null,0,null,null,null,null,null,null,null,null,null,null,null,null,161040,0]
[1202038,"Estrabismo, trat. quir. completo (uno o ambos ojos)",0,null,null,null,null,0,null,null,null,null,null,null,0,null,null,0,null,null,0,null,null,0,null,null,null,null,null,null,null,null,null,null,null,null,166360,0]
[1202039,"Exanteración ocular (proc. aut.)",0,null,null,null,null,0,null,null,null,null,null,null,0,null,null,0,null,null,0,null,null,0,null,null,null,null,null,null,null,null,null,null,null,null,118720,0]
[1202040,"Lesión traumática, sutura de (proc. aut.)",0,null,null,null,null,0,null,null,null,null,null,null,0,null,null,0,null,null,0,null,null,0,null,null,null,null,null,null,null,null,null,null,null,null,60770,0]
[1202041,"Cirugía refractiva, queratotomía radial o similar con bisturí de diamante",0,null,null,null,null,0,null,null,null,null,null,null,0,null,null,0,null,null,0,null,null,0,null,null,null,null,null,null,null,null,null,null,null,null,86460,0]
[1202042,"Crioterapia y recesión conjuntival",0,null,null,null,null,0,null,null,null,null,null,null,null,null,null,null,null,null,null,null,null,null,null,null,null,null,null,null,null,null,null,null,null,null,37350,0]
[1202044,"Cuerpo extraño, extracción quir. de",0,null,null,null,null,0,null,null,null,null,null,null,null,null,null,null,null,null,null,null,null,null,null,null,null,null,null,null,null,null,null,null,null,null,24710,0]
[1202045,"Glaucoma, trat. quir. por cualquier técnica",0,null,null,null,null,0,null,null,null,null,null,null,0,null,null,0,null,null,0,null,null,0,null,null,null,null,null,null,null,null,null,null,null,null,175910,0]
[1202046,"Herida penetrante corneal o corneo-escleral o dehiscencia de sutura",0,null,null,null,null,0,null,null,null,null,null,null,0,null,null,0,null,null,0,null,null,0,null,null,null,null,null,null,null,null,null,null,null,null,89680,0]
[1202047,"Queratectomía laminar",0,null,null,null,null,0,null,null,null,null,null,null,0,null,null,0,null,null,0,null,null,0,null,null,null,null,null,null,null,null,null,null,null,null,97250,0]
[1202048,"Queratoplastía. Injerto lamelar o penetrante trat. quir. Completo",0,null,null,null,null,0,null,null,null,null,null,null,0,null,null,0,null,null,0,null,null,0,null,null,null,null,null,null,null,null,null,null,null,null,204040,0]
[1202049,"Queratoprótesis, implantación de (no incluye el valor de la prótesis)",0,null,null,null,null,0,null,null,null,null,null,null,0,null,null,0,null,null,0,null,null,0,null,null,null,null,null,null,null,null,null,null,null,null,234300,0]
[1202050,"Recubrimiento conjuntival",0,null,null,null,null,0,null,null,null,null,null,null,0,null,null,0,null,null,0,null,null,0,null,null,null,null,null,null,null,null,null,null,null,null,108300,0]
[1202051,"Rehabilitación superficie ocular (con injerto de mucosa)",0,null,null,null,null,0,null,null,null,null,null,null,0,null,null,0,null,null,0,null,null,0,null,null,null,null,null,null,null,null,null,null,null,null,108300,0]
[1202070,"Sinequiotomía (proc. aut.)",0,null,null,null,null,0,null,null,null,null,null,null,0,null,null,0,null,null,0,null,null,0,null,null,null,null,null,null,null,null,null,null,null,null,62140,0]
[1202073,"Operación triple (injerto, facoéresis e implante de lente intraocular) (no incluye valor de la prótesis)",0,null,null,null,null,0,null,null,null,null,null,null,0,null,null,0,null,null,0,null,null,0,null,null,null,null,null,null,null,null,null,null,null,null,335810,0]
[1202173,"Operación triple (injerto, facoéresis e implante de lente intraocular) (incluye valor de la prótesis)",0,null,null,null,null,0,null,null,null,null,null,null,0,null,null,0,null,null,0,null,null,0,null,null,null,null,null,null,null,null,null,null,null,null,457470,0]
[1202053,"Iridectomía periférica y/u óptica, (proc. aut.)",0,null,null,null,null,0,null,null,null,null,null,null,0,null,null,0,null,null,0,null,null,0,null,null,null,null,null,null,null,null,null,null,null,null,78600,0]
[1202054,"Tumor ocular, trat. quir.",0,null,null,null,null,0,null,null,null,null,null,null,0,null,null,0,null,null,0,null,null,0,null,null,null,null,null,null,null,null,null,null,null,null,142410,0]
[1202074,"Hernia de iris y/o fístulas, reparación de",0,null,null,null,null,0,null,null,null,null,null,null,0,null,null,0,null,null,0,null,null,0,null,null,null,null,null,null,null,null,null,null,null,null,96570,0]
[1202055,"Desgarro  con o sin desprendimiento, diatermo y/o crio y/o fotocoagulación (incluye endofotocoagulación intraquirúrgica )",0,null,null,null,null,0,null,null,null,null,null,null,null,null,null,null,null,null,null,null,null,null,null,null,null,null,null,null,null,null,null,null,null,null,86160,0]
[1202056,"Desprendimiento retinal, cirugía convencional (exoimplantes)",0,null,null,null,null,0,null,null,null,null,null,null,0,null,null,0,null,null,0,null,null,0,null,null,null,null,null,null,null,null,null,null,null,null,193320,0]
[1202058,"Tumor, diatermo y/o crío y/o fotocoagulación de",0,null,null,null,null,0,null,null,null,null,null,null,null,null,null,null,null,null,null,null,null,null,null,null,null,null,null,null,null,null,null,null,null,null,78600,0]
[1202059,"Vasculopatía retinal (excepto retinopatía proliferativa) diatermo y/o crio y/o fotocoagulación (incluye endofotocoagulación intraquirúrgica)",0,null,null,null,null,0,null,null,null,null,null,null,null,null,null,null,null,null,null,null,null,null,null,null,null,null,null,null,null,null,null,null,null,null,106410,0]
[1202060,"Vitrectomía c/retinotomía (c/s inyección de gas o silicona)",0,null,null,null,null,0,null,null,null,null,null,null,0,null,null,0,null,null,0,null,null,0,null,null,null,null,null,null,null,null,null,null,null,null,321320,0]
[1202061,"Vitrectomía con inyección de gas o silicona",0,null,null,null,null,0,null,null,null,null,null,null,0,null,null,0,null,null,0,null,null,0,null,null,null,null,null,null,null,null,null,null,null,null,287510,0]
[1202062,"Vitrectomía con vitreófago (proc. aut)",0,null,null,null,null,{"$f":"+I1252+J1252","v":0},null,null,null,null,null,null,0,null,null,0,null,null,0,null,null,0,null,null,null,null,null,null,null,null,null,null,null,null,191810,{"$f":"AK1252*I1252","v":0}]
[1202075,"Retinopexia neumática",{"$f":"SUM(I1253:N1253)","v":0},null,null,null,null,0,null,null,null,null,null,null,{"$f":"SUM(P1253:Q1253)","v":0},null,null,{"$f":"SUM(S1253:T1253)","v":0},null,null,{"$f":"SUM(V1253:W1253)","v":0},null,null,{"$f":"SUM(Y1253:Z1253)","v":0},null,null,null,null,null,null,null,null,null,null,null,null,155630,0]
[1202077,"Desprendimiento coroídeo o hemorragia coroídea, trat. quir.",0,null,null,null,null,0,null,null,null,null,null,null,0,null,null,0,null,null,0,null,null,0,null,null,null,null,null,null,null,null,null,null,null,null,81700,0]
[1202063,"Facoéresis intracapsular o catarata secundaria o discisión y aspiración de masas",0,null,null,null,null,0,null,null,null,null,null,null,0,null,null,0,null,null,0,null,null,0,null,null,null,null,null,null,null,null,null,null,null,null,150070,0]
[1202064,"Facoéresis extracapsular con implante de lente intraocular (no incluye el valor de la prótesis)",0,null,null,null,null,0,null,null,null,null,null,null,0,null,null,0,null,null,0,null,null,0,null,null,null,null,null,null,null,null,null,null,null,null,461080,0]
[1202164,"Facoéresis extracapsular con implante de lente intraocular (incluye el valor de la prótesis) ",0,null,null,null,null,0,null,null,null,null,null,null,0,null,null,0,null,null,0,null,null,0,null,null,null,null,null,null,null,null,null,null,null,null,582730,0]
[1202065,"Implante secundario de lente intraocular",0,null,null,null,null,0,null,null,null,null,null,null,0,null,null,0,null,null,0,null,null,0,null,null,null,null,null,null,null,null,null,null,null,null,266810,0]
[1202066,"Aspiración esferular c/s capsulotomía",0,null,null,null,null,0,null,null,null,null,null,null,0,null,null,0,null,null,0,null,null,0,null,null,null,null,null,null,null,null,null,null,null,null,75370,0]
[1202076,"Extracción o corrección de desplazamiento de lente intraocular",0,null,null,null,null,0,null,null,null,null,null,null,0,null,null,0,null,null,0,null,null,0,null,null,null,null,null,null,null,null,null,null,null,null,161040,0]
[1202057,"Retinopatía proliferativa, (diabética, hipertensiva, eales y otras) panfotocoagulación trat. completo   (incluye endofotocoagulación intraquirúrgica )",0,null,null,null,null,0,null,null,null,null,null,null,null,null,null,null,null,null,null,null,null,null,null,null,null,null,null,null,null,null,null,null,null,null,150920,0]
[1202067,"Discisión de cápsula posterior",0,null,null,null,null,0,null,null,null,null,null,null,null,null,null,null,null,null,null,null,null,null,null,null,null,null,null,null,null,null,null,null,null,null,168900,0]
[1202068,"Iridotomía",0,null,null,null,null,0,null,null,null,null,null,null,null,null,null,null,null,null,null,null,null,null,null,null,null,null,null,null,null,null,null,null,null,null,168900,0]
[1202069,"Trabeculoplastía o iridoplastía",0,null,null,null,null,0,null,null,null,null,null,null,null,null,null,null,null,null,null,null,null,null,null,null,null,null,null,null,null,null,null,null,null,null,168900,0]
[1202078,"Cirugía fotorrefractiva o fototerapéutica de córnea, cualquier técnica",0,null,null,null,null,0,null,null,null,null,null,null,0,null,null,0,null,null,0,null,null,0,null,null,null,null,null,null,null,null,null,null,null,null,154770,0]
[null,"TOTAL",{"$f":"SUM(C1188:C1265)","v":0},null,null,null,null,{"$f":"SUM(H1188:H1265)","v":0},{"$f":"SUM(I1188:I1265)","v":0},0,0,0,0,0,12,6,6,12,6,6,0,0,0,0,0,0,0,0,0,0,0,0,0,0,0,0,9557150,0]
[null,"PROCEDIMIENTOS DE OTORRINOLARINGOLOGÍA "]
[1301001,"Electrogustometria",{"$f":"SUM(D1268+G1268)","v":0},{"$f":"SUM(E1268:F1268)","v":0}]
[1301002,"Rinomanometria c/s vasocontrictor",0,0]
[1301003,"Nasofaringolaringofibroscopia",0,0]
[1301004,"Rinoscopia posterior, con nasofaringoscopia c/s toma",0,0]
[1301005,"Sinusoscopia de cada seno maxilar por puncion, c/s biopsia,",0,0]
[1301006,"Laringoscopia y/o traqueoscopia directa c/s toma de muestra, c/s biopsia con microscopio",0,0]
[1301007,"Laringoscopia y/o traqueoscopia directa c/s toma de muestra, c/s biopsia sin microscopio",0,0]
[1301021,"Audiometría adultos",0,0]
[1301008,"Audiometría niños",0,0]
[1301009,"Impedanciometría",0,0]
[1301010,"Calibración de audífonos o implantes",0,0]
[1301011,"Potenciales evocados auditivos",0,0]
[1301012,"Cócleovestibular con electronistagmografía",0,0]
[1301015,"Electronistagmografía o Videoelectronistagmografía c/s nistag.de posición",0,0]
[1301016,"Función tubaria",0,0]
[1301017,"Prueba calórica o prueba calórica mínima (proc.aut.)",0,0]
[1301019,"Test de glicerol (con 3 audiometrías)",0,0]
[1301020,"Examen funcional de VIII par",{"$f":"SUM(D1285+G1285)","v":0},{"$f":"SUM(E1285:F1285)","v":0}]
[1301024,"Senos perinasales, puncion evacuadora c/s toma de muestras,",0,0]
[1301025,"Taponamiento nasal anterior (proc. aut.)",0,0]
[1301026,"Taponamiento nasal posterior",0,0]
[1301027,"Vaciamiento cavid. Perinasales (proetz y sim.) (10 sesiones)",0,0]
[1301028,"Cauterización uni o bilateral de vasos en fosa nasal anterior",0,0]
[1301029,"Cuerpo extraño en fosas nasales, extraccion en adultos        ",0,0]
[1301030,"Cuerpo extraño en fosas nasales, extraccion en niños        ",0,0]
[1301035,"Cuerpo extraño en laringe y/o traquea, extraccion de (incluyela endoscopia con tubo rigido): En adultos",0,0]
[1301036,"Cuerpo extraño en laringe y/o traquea, extraccion de (incluyela endoscopia con tubo rigido): En ninos",0,0]
[1301037,"Dilatacion esofagica por sesion",0,0]
[1301038,"Dilatacion esofagica por sesion en ninos",0,0]
[1301039,"Dilatacion esofagica por sesion en adultos",0,0]
[1301040,"Lesiones del oido externo y/o medio, curacion bajo micros",0,0]
[1301041,"Trompa de eustaquio, insuflacion instrumental (proc. Aut.)",0,0]
[1301042,"Trompa de eustaquio, insuflacion instrumental (proc. Aut.) en adultos                                                                             ",0,0]
[1301043,"Trompa de eustaquio, insuflacion instrumental (proc. Aut.) en ninos                                                                                     ",0,0]
[1301044,"Biopsia oido (proc. Aut.)",0,0]
[1303001,"Evaluacion de la voz (incluye respiracion, tonicidad     ",0,0]
[1303002,"Evaluacion del habla (incluye articulacion, prosodia,     ",0,0]
[1303003,"Evaluacion del lenguaje (incluye voz, habla y aspecto   ",0,0]
[1303004,"Rehabilitacion de la voz (maximo 15 sesiones anuales)  (cada sesion minimo 30'') (Fonoaudiológo)",0,0]
[1303005,"Rehabilitacion del habla y/o del lenguaje (maximo 30 sesiones anuales) (cada sesion minimo 30'') (Fonoaudiológo)",0,0]
[5099091,"Audiometria campo libre                                      ",0,0]
[5099092,"Retiro de taponaje anterior",0,0]
[5099093,"Retiro de yeso",0,0]
[5099094,"Cambio de canula traqueostomia (enfermera Otorrino)",0,0]
[5099095,"Estroboscopia",0,0]
[null,"Emisiones otoacústicas",0,0]
[null,"Electrococleografía ",0,0]
[null,"Análisis audifono",0,0]
[null,"VEMP (potencial miogénico vestibular)",0,0]
[null,"Maniobras de reposición de particulas",0,0]
[null,"Prueba calórica mínima",0,0]
[null,"Rehabilitación vestibular",0,0]
[null,"Nasofibroscopía",0,0]
[null,"Laringoscopía",0,0]
[null,"Rinometría acústica",0,0]
[null,"Maniobras de reposición vestibular ",0,0]
[null,"Potenciales miogenicos vestibulares",0,0]
[null,"Terapia de rehabilitación de la voz en paciente laringectomizado",0,0]
[null,"Habituación vestibular",0,0]
[null,"Timpanometría de banda ancha",0,0]
[null,"Estudio funcional de equilibrio en plataforma",0,0]
[null,"Video oculonistgamografía en sillón rotatorio",0,0]
[null,"Estimulación repetitiva",0,0]
[null,"TOTAL",{"$f":"SUM(C1268:C1330)","v":0},{"$f":"SUM(D1268:D1330)","v":0},0,0,0,null,null,null,null,null,null,null,null,null,null,null,null,null,null,null,null,null,null,null,{"$f":"SUM(AA1268:AA1330)","v":0},{"$f":"SUM(AB1268:AB1330)","v":0},{"$f":"SUM(AC1268:AC1330)","v":0},0,0,0,0,0,0,0]
[null,"GRUPO 13 : CIRUGIA OTORRINOLARINGOLOGICA       "]
[1302001,"Absceso y/o hematomas, trat. quir.",{"$f":"SUM(I1333:N1333)","v":0},null,null,null,null,{"$f":"+I1333+J1333","v":0},null,null,null,null,null,null,null,null,null,null,null,null,null,null,null,null,null,null,null,null,null,null,null,null,null,null,null,null,14010,{"$f":"AK1333*I1333","v":0}]
[1302002,"Extracción cuerpo extraño en conducto auditivo externo",{"$f":"SUM(I1334:N1334)","v":0},null,null,null,null,0,null,null,null,null,null,null,null,null,null,null,null,null,null,null,null,null,null,null,null,null,null,null,null,null,null,null,null,null,35950,0]
[1302003,"Fístula preauricular complicada, trat. quir.",{"$f":"SUM(I1335:N1335)","v":0},null,null,null,null,0,null,null,null,null,null,null,null,null,null,null,null,null,null,null,null,null,null,null,null,null,null,null,null,null,null,null,null,null,130390,0]
[1302004,"Extirpación de tumor de conducto auditivo externo",0,null,null,null,null,0,null,null,null,null,null,null,null,null,null,null,null,null,null,null,null,null,null,null,null,null,null,null,null,null,null,null,null,null,26560,0]
[1302005,"Tumor maligno, trat. quir.",0,null,null,null,null,0,null,null,null,null,null,null,null,null,null,null,null,null,null,null,null,null,null,null,null,null,null,null,null,null,null,null,null,null,135950,0]
[1302006,"Estapedectomía o estapedostomía ",0,null,null,null,null,0,null,null,null,null,null,null,{"$f":"SUM(P1338:Q1338)","v":0},null,null,{"$f":"SUM(S1338:T1338)","v":0},null,null,{"$f":"SUM(V1338:W1338)","v":0},null,null,{"$f":"SUM(Y1338:Z1338)","v":0},null,null,null,null,null,null,null,null,null,null,null,null,190980,0]
[1302007,"Mastoidectomía c/s sección cuerda del tímpano",0,null,null,null,null,0,null,null,null,null,null,null,0,null,null,0,null,null,0,null,null,0,null,null,null,null,null,null,null,null,null,null,null,null,204000,0]
[1302008,"Tratamiento quirúrgico de Mucositis timpánica, otitis media con efusión uni o bilateral",0,null,null,null,null,0,null,null,null,null,null,null,null,null,null,null,null,null,null,null,null,null,null,null,null,null,null,null,null,null,null,null,null,null,105340,0]
[1302009,"Operación radical de oído",0,null,null,null,null,0,null,null,null,null,null,null,0,null,null,0,null,null,0,null,null,0,null,null,null,null,null,null,null,null,null,null,null,null,183230,0]
[1302010,"Petrositis, trat. quir.",0,null,null,null,null,0,null,null,null,null,null,null,0,null,null,0,null,null,0,null,null,0,null,null,null,null,null,null,null,null,null,null,null,null,188450,0]
[1302011,"Reconstitución funcional de oído radicalizado",0,null,null,null,null,0,null,null,null,null,null,null,0,null,null,0,null,null,0,null,null,0,null,null,null,null,null,null,null,null,null,null,null,null,245820,0]
[1302012,"Timpanoplastía funcional (cualquier tipo) c/s mastoidectomía",0,null,null,null,null,0,null,null,null,null,null,null,0,null,null,0,null,null,0,null,null,0,null,null,null,null,null,null,null,null,null,null,null,null,183230,0]
[1302013,"Reconstitución plástica de conducto auditivo externo cartilaginoso",0,null,null,null,null,0,null,null,null,null,null,null,0,null,null,0,null,null,0,null,null,0,null,null,null,null,null,null,null,null,null,null,null,null,227940,0]
[1302014,"Exostosis u osteoma, resección por cualquier vía  ",0,null,null,null,null,0,null,null,null,null,null,null,0,null,null,0,null,null,0,null,null,0,null,null,null,null,null,null,null,null,null,null,null,null,172840,0]
[1302015,"Neurectomía de Jacobson",0,null,null,null,null,0,null,null,null,null,null,null,0,null,null,0,null,null,0,null,null,0,null,null,null,null,null,null,null,null,null,null,null,null,164540,0]
[1302016,"Reconstitución de conducto auditivo externo, c/s tímpanoplastía (incluye revisión de cadena osicular)",0,null,null,null,null,0,null,null,null,null,null,null,0,null,null,0,null,null,0,null,null,0,null,null,null,null,null,null,null,null,null,null,null,null,204000,0]
[1302017,"Tratamiento quirúrgico de tumor glómico timpánico",0,null,null,null,null,0,null,null,null,null,null,null,0,null,null,0,null,null,0,null,null,0,null,null,null,null,null,null,null,null,null,null,null,null,227940,0]
[1302018,"Laberintectomía",0,null,null,null,null,0,null,null,null,null,null,null,0,null,null,0,null,null,0,null,null,0,null,null,null,null,null,null,null,null,null,null,null,null,183230,0]
[1302019,"Neurinoma del acústico, trat. quir. vía translaberíntica y/o fosa media",0,null,null,null,null,0,null,null,null,null,null,null,0,null,null,0,null,null,0,null,null,0,null,null,null,null,null,null,null,null,null,null,null,null,299820,0]
[1302020,"Descompresión intraósea c/s plastía",0,null,null,null,null,0,null,null,null,null,null,null,0,null,null,0,null,null,0,null,null,0,null,null,null,null,null,null,null,null,null,null,null,null,170730,0]
[1302021,"Lesiones a nivel del conducto auditivo interno, trat. quir.",0,null,null,null,null,0,null,null,null,null,null,null,0,null,null,0,null,null,0,null,null,0,null,null,null,null,null,null,null,null,null,null,null,null,271560,0]
[1302022,"Biopsia buco-faríngea (proc. aut.)",0,null,null,null,null,0,null,null,null,null,null,null,null,null,null,null,null,null,null,null,null,null,null,null,null,null,null,null,null,null,null,null,null,null,20990,0]
[1302023,"Sección y/o resección frenillos cavidad bucal",0,null,null,null,null,0,null,null,null,null,null,null,null,null,null,null,null,null,null,null,null,null,null,null,null,null,null,null,null,null,null,null,null,null,14010,0]
[1302024,"Drenaje de absceso o flegmón de piso de boca",0,null,null,null,null,0,null,null,null,null,null,null,null,null,null,null,null,null,null,null,null,null,null,null,null,null,null,null,null,null,null,null,null,null,19200,0]
[1302025,"Drenaje de absceso o flegmón periamigdaliano",0,null,null,null,null,0,null,null,null,null,null,null,null,null,null,null,null,null,null,null,null,null,null,null,null,null,null,null,null,null,null,null,null,null,28600,0]
[1302026,"Sección simple y/o resección frenillo sublingual retrofaríngeo o faringolaríngeo",0,null,null,null,null,0,null,null,null,null,null,null,null,null,null,null,null,null,null,null,null,null,null,null,null,null,null,null,null,null,null,null,null,null,30400,0]
[1302027,"Drenaje de absceso o flegmón de vestíbulo bucal",0,null,null,null,null,0,null,null,null,null,null,null,null,null,null,null,null,null,null,null,null,null,null,null,null,null,null,null,null,null,null,null,null,null,14010,0]
[1302028,"Adenoidectomía (proc. aut.)",0,null,null,null,null,0,null,null,null,null,null,null,0,null,null,0,null,null,0,null,null,0,null,null,null,null,null,null,null,null,null,null,null,null,118920,0]
[1302029,"Amigdalectomía c/s adenoidectomía, uni o bilateral",0,null,null,null,null,0,null,null,null,null,null,null,0,null,null,0,null,null,0,null,null,0,null,null,null,null,null,null,null,null,null,null,null,null,133300,0]
[1302030,"Extracción de cálculos o tapones salivales",0,null,null,null,null,0,null,null,null,null,null,null,null,null,null,null,null,null,null,null,null,null,null,null,null,null,null,null,null,null,null,null,null,null,19200,0]
[1302031,"Tumor benigno de la mucosa bucal,  extirp. c/s  biopsia bucofaríngea",0,null,null,null,null,0,null,null,null,null,null,null,null,null,null,null,null,null,null,null,null,null,null,null,null,null,null,null,null,null,null,null,null,null,19200,0]
[1302032,"Tumor maligno de las amígdalas, trat. quir.",0,null,null,null,null,0,null,null,null,null,null,null,0,null,null,0,null,null,0,null,null,0,null,null,null,null,null,null,null,null,null,null,null,null,164540,0]
[1302033,"Extirpacion de  tumor benigno de la base de la lengua                                                                                      ",0,null,null,null,null,0,null,null,null,null,null,null,0,null,null,0,null,null,0,null,null,0,null,null,null,null,null,null,null,null,null,null,null,null,146540,{"$f":"AK1365*I1365","v":0}]
[1302034,"Extirpación tumor maligno de base de lengua",0,null,null,null,null,0,null,null,null,null,null,null,0,null,null,0,null,null,0,null,null,0,null,null,null,null,null,null,null,null,null,null,null,null,326480,0]
[1302035,"Faringoplastía (cualq. técn.), c/s desplazamiento de colgajos",0,null,null,null,null,0,null,null,null,null,null,null,0,null,null,0,null,null,0,null,null,0,null,null,null,null,null,null,null,null,null,null,null,null,232280,0]
[1302036,"Fibroangioma del rinofarinx, trat. quir.",0,null,null,null,null,0,null,null,null,null,null,null,0,null,null,0,null,null,0,null,null,0,null,null,null,null,null,null,null,null,null,null,null,null,321250,0]
[1302037,"Glosectomía total",0,null,null,null,null,0,null,null,null,null,null,null,0,null,null,0,null,null,0,null,null,0,null,null,null,null,null,null,null,null,null,null,null,null,336880,0]
[1302038,"Abscesos y hematoma del tabique nasal, trat. quir.",0,null,null,null,null,0,null,null,null,null,null,null,null,null,null,null,null,null,null,null,null,null,null,null,null,null,null,null,null,null,null,null,null,null,27740,0]
[1302039,"Arteria esfenopalatina, cauterización por vía nasal",0,null,null,null,null,0,null,null,null,null,null,null,null,null,null,null,null,null,null,null,null,null,null,null,null,null,null,null,null,null,null,null,null,null,130390,0]
[1302040,"Arteria maxilar interna, ligadura de (por vía transmaxilar)",0,null,null,null,null,0,null,null,null,null,null,null,0,null,null,0,null,null,0,null,null,0,null,null,null,null,null,null,null,null,null,null,null,null,152020,0]
[1302041,"Arterias etmoidales anteriores, ligadura de",0,null,null,null,null,0,null,null,null,null,null,null,null,null,null,null,null,null,null,null,null,null,null,null,null,null,null,null,null,null,null,null,null,null,111780,0]
[1302042,"Turbinectomía o cauterización de cornetes, cualquier técnica ",0,null,null,null,null,0,null,null,null,null,null,null,null,null,null,null,null,null,null,null,null,null,null,null,null,null,null,null,null,null,null,null,null,null,37730,0]
[1302043,"Conducto y/o seno lagrimal, obstrucción del, trat. quir. por vía nasal",0,null,null,null,null,0,null,null,null,null,null,null,0,null,null,0,null,null,0,null,null,0,null,null,null,null,null,null,null,null,null,null,null,null,143100,0]
[1302044,"Etmoidectomía endo o exonasal",0,null,null,null,null,0,null,null,null,null,null,null,0,null,null,0,null,null,0,null,null,0,null,null,null,null,null,null,null,null,null,null,null,null,164540,0]
[1302045,"Tratamiento quirúrgico de las fistulas buco-sinusales o buco-nasales  y/o retiro cuerpos extraños del seno maxilar",0,null,null,null,null,0,null,null,null,null,null,null,0,null,null,0,null,null,0,null,null,0,null,null,null,null,null,null,null,null,null,null,null,null,137580,0]
[1302046,"Fract. nasal reciente, cerrada o expuesta, reducción c/s inmovilización ",0,null,null,null,null,0,null,null,null,null,null,null,null,null,null,null,null,null,null,null,null,null,null,null,null,null,null,null,null,null,null,null,null,null,26180,0]
[1302047,"Nervio vidiano, sección del (por cualquier vía)",0,null,null,null,null,0,null,null,null,null,null,null,0,null,null,0,null,null,0,null,null,0,null,null,null,null,null,null,null,null,null,null,null,null,170730,0]
[1302048,"Perforación del tabique, trat. quir.",0,null,null,null,null,0,null,null,null,null,null,null,null,null,null,null,null,null,null,null,null,null,null,null,null,null,null,null,null,null,null,null,null,null,111780,0]
[1302049,"Tratamiento quirúrgico pólipo nasal",0,null,null,null,null,0,null,null,null,null,null,null,null,null,null,null,null,null,null,null,null,null,null,null,null,null,null,null,null,null,null,null,null,null,32450,0]
[1302050,"Rinitis atrófica, trat. por inclusión submucosa, con cualquier material, uni o bilateral",0,null,null,null,null,0,null,null,null,null,null,null,0,null,null,0,null,null,0,null,null,0,null,null,null,null,null,null,null,null,null,null,null,null,118920,0]
[1302051,"Rinofima, trat. quir.",0,null,null,null,null,0,null,null,null,null,null,null,0,null,null,0,null,null,0,null,null,0,null,null,null,null,null,null,null,null,null,null,null,null,155110,0]
[1302052,"Rinoplastía y/o septoplastía, cualquier técnica",0,null,null,null,null,0,null,null,null,null,null,null,0,null,null,0,null,null,0,null,null,0,null,null,null,null,null,null,null,null,null,null,null,null,175880,0]
[1302053,"Seno esfenoidal, abertura por cualquier vía ",0,null,null,null,null,0,null,null,null,null,null,null,0,null,null,0,null,null,0,null,null,0,null,null,null,null,null,null,null,null,null,null,null,null,170730,0]
[1302054,"Tratamiento quirúrgico de seno frontal, cualquier vía",0,null,null,null,null,0,null,null,null,null,null,null,0,null,null,0,null,null,0,null,null,0,null,null,null,null,null,null,null,null,null,null,null,null,143100,0]
[1302055,"Antrostomía seno maxilar, cualquier vía",0,null,null,null,null,0,null,null,null,null,null,null,0,null,null,0,null,null,0,null,null,0,null,null,null,null,null,null,null,null,null,null,null,null,152020,0]
[1302056,"Sinequia nasal, trat. quir.",0,null,null,null,null,0,null,null,null,null,null,null,null,null,null,null,null,null,null,null,null,null,null,null,null,null,null,null,null,null,null,null,null,null,20990,0]
[1302057,"Tumor nasal, extirp. por rinotomía lateral",0,null,null,null,null,0,null,null,null,null,null,null,0,null,null,0,null,null,0,null,null,0,null,null,null,null,null,null,null,null,null,null,null,null,143100,0]
[1302058,"Vaciamiento etmoidal por vía nasal c/s polipectomía",0,null,null,null,null,0,null,null,null,null,null,null,0,null,null,0,null,null,0,null,null,0,null,null,null,null,null,null,null,null,null,null,null,null,118920,0]
[1302059,"Aritenoidectomía vía endoscópica",0,null,null,null,null,0,null,null,null,null,null,null,null,null,null,null,null,null,null,null,null,null,null,null,null,null,null,null,null,null,null,null,null,null,111780,0]
[1302060,"Aritenoidectomía vía externa",0,null,null,null,null,0,null,null,null,null,null,null,0,null,null,0,null,null,0,null,null,0,null,null,null,null,null,null,null,null,null,null,null,null,152020,0]
[1302061,"Decorticación de cuerdas vocales c/microscopio",0,null,null,null,null,0,null,null,null,null,null,null,0,null,null,0,null,null,0,null,null,0,null,null,null,null,null,null,null,null,null,null,null,null,133310,0]
[1302062,"Tumor benigno de cuerdas vocales, trat. quirúrgico por vía abierta ",0,null,null,null,null,0,null,null,null,null,null,null,null,null,null,null,null,null,null,null,null,null,null,null,null,null,null,null,null,null,null,null,null,null,110790,0]
[1302063,"Tumor benigno de cuerdas vocales, trat. quirúrgico por vía endoscópica",0,null,null,null,null,0,null,null,null,null,null,null,null,null,null,null,null,null,null,null,null,null,null,null,null,null,null,null,null,null,null,null,null,null,110790,0]
[1302064,"Cordectomía, sinequia y otras malformaciones, trat. quirúrgico por vía externa ",0,null,null,null,null,0,null,null,null,null,null,null,0,null,null,0,null,null,0,null,null,0,null,null,null,null,null,null,null,null,null,null,null,null,143100,0]
[1302065,"Estenosis laringotraqueales y/o faríngeas, trat. quir. por vía abierta (incluye reconstrucción laringotraqueal) ",0,null,null,null,null,{"$f":"+I1397+J1397","v":0},null,null,null,null,null,null,0,null,null,0,null,null,0,null,null,0,null,null,null,null,null,null,null,null,null,null,null,null,275530,{"$f":"AK1397*I1397","v":0}]
[1302066,"Laringectomía parcial o subtotal (cualquier técnica)",0,null,null,null,null,0,null,null,null,null,null,null,{"$f":"SUM(P1398:Q1398)","v":0},null,null,0,null,null,0,null,null,0,null,null,null,null,null,null,null,null,null,null,null,null,305060,0]
[1302067,"Laringectomía total más faringectomía parcial",{"$f":"SUM(I1399:N1399)","v":0},null,null,null,null,0,null,null,null,null,null,null,0,null,null,{"$f":"SUM(S1399:T1399)","v":0},null,null,{"$f":"SUM(V1399:W1399)","v":0},null,null,{"$f":"SUM(Y1399:Z1399)","v":0},null,null,null,null,null,null,null,null,null,null,null,null,411960,0]
[1302068,"Laringectomía total más faringectomía total y/o esofagectomía cervical",0,null,null,null,null,0,null,null,null,null,null,null,0,null,null,0,null,null,0,null,null,0,null,null,null,null,null,null,null,null,null,null,null,null,622280,0]
[1302069,"Laringocele, trat. quir.",0,null,null,null,null,0,null,null,null,null,null,null,0,null,null,0,null,null,0,null,null,0,null,null,null,null,null,null,null,null,null,null,null,null,137580,0]
[1302070,"Papilomas laríngeos, trat. quir. (por sesión)",0,null,null,null,null,0,null,null,null,null,null,null,null,null,null,null,null,null,null,null,null,null,null,null,null,null,null,null,null,null,null,null,null,null,43380,0]
[1302071,"Parálisis de cuerdas vocales, trat. quir. cualquier técnica",0,null,null,null,null,0,null,null,null,null,null,null,0,null,null,0,null,null,0,null,null,0,null,null,null,null,null,null,null,null,null,null,null,null,143100,0]
[1302072,"Traqueostomía (proc. aut.)",0,null,null,null,null,0,null,null,null,null,null,null,0,null,null,0,null,null,0,null,null,0,null,null,null,null,null,null,null,null,null,null,null,null,137580,0]
[null,"TOTAL ARANCEL MAI",{"$f":"SUM(C1333:C1404)","v":0},null,null,null,null,{"$f":"SUM(H1333:H1404)","v":0},0,0,0,0,0,0,0,0,0,0,0,0,0,0,0,{"$f":"SUM(X1333:X1404)","v":0},0,0,0,0,0,0,0,0,0,0,0,0,10795360,0]
[null,"Implante Coclear",0,null,null,null,null,{"$f":"+I1406+J1406","v":0},null,null,null,null,null,null,0,null,null,0,null,null,0,null,null,0,null,null,null,null,null,null,null,null,null,null,null,null,null,{"$f":"AK1406*E1406","v":0}]
[null,"TOTAL ARANCEL MLE Y NO ARANCELADO",{"$f":"C1406","v":0},null,null,null,null,{"$f":"H1406","v":0},0,0,0,0,0,0,0,0,0,0,0,0,0,0,0,0,0,0,0,0,0,0,0,0,0,0,0,0]
[null,"TOTAL PRODUCCION",{"$f":"C1405+C1407","v":0},null,null,null,null,{"$f":"H1405+H1407","v":0},0,0,0,0,0,0,0,0,0,0,0,0,0,0,0,0,0,0,0,0,0,0,0,0,0,0,0,0,10795360,0]
[null,"GRUPO 14 : PROCEDIMIENTO DE CABEZA Y CUELLO     "]
[1401001,"Punción aspirativa con aguja fina de nódulo tiroideo",{"$f":"SUM(D1410+G1410)","v":0},{"$f":"SUM(E1410:F1410)","v":0},null,null,null,null,null,null,null,null,null,null,null,null,null,null,null,null,null,null,null,null,null,null,null,null,null,null,null,null,null,null,null,null,10040,{"$f":"AK1410*E1410","v":0}]
[null,"TOTAL",{"$f":"C1410","v":0},{"$f":"D1410","v":0},{"$f":"E1410","v":0},{"$f":"F1410","v":0},{"$f":"G1410","v":0},null,null,null,null,null,null,null,null,null,null,null,null,null,null,null,null,null,null,null,{"$f":"AA1410","v":0},{"$f":"AB1410","v":0},0,0,0,0,0,0,0,0,10040,0]
[null,"CIRUGIA DE CABEZA Y CUELLO"]
[1402001,"Tiroidectomía bilateral total",{"$f":"SUM(I1413:N1413)","v":0},null,null,null,null,{"$f":"+I1413+J1413","v":0},null,null,null,null,null,null,{"$f":"SUM(P1413:Q1413)","v":0},null,null,{"$f":"SUM(S1413:T1413)","v":0},null,null,{"$f":"SUM(V1413:W1413)","v":0},null,null,{"$f":"SUM(Y1413:Z1413)","v":0},null,null,null,null,null,null,null,null,null,null,null,null,281970,{"$f":"AK1413*I1413","v":0}]
[1402002,"Tiroidectomía bilateral subtotal",{"$f":"SUM(I1414:N1414)","v":0},null,null,null,null,0,null,null,null,null,null,null,{"$f":"SUM(P1414:Q1414)","v":0},null,null,{"$f":"SUM(S1414:T1414)","v":0},null,null,{"$f":"SUM(V1414:W1414)","v":0},null,null,{"$f":"SUM(Y1414:Z1414)","v":0},null,null,null,null,null,null,null,null,null,null,null,null,224810,0]
[1402003,"Bocio intratorácico, trat. quir. por esternotomía",0,null,null,null,null,0,null,null,null,null,null,null,{"$f":"SUM(P1415:Q1415)","v":0},null,null,{"$f":"SUM(S1415:T1415)","v":0},null,null,{"$f":"SUM(V1415:W1415)","v":0},null,null,{"$f":"SUM(Y1415:Z1415)","v":0},null,null,null,null,null,null,null,null,null,null,null,null,338060,0]
[1402004,"Extirpación de Tiroides lingual",0,null,null,null,null,0,null,null,null,null,null,null,0,null,null,0,null,null,0,null,null,0,null,null,null,null,null,null,null,null,null,null,null,null,316080,0]
[1402005,"Lobectomía con o sin istmectomía o resección parcial",0,null,null,null,null,0,null,null,null,null,null,null,0,null,null,0,null,null,0,null,null,0,null,null,null,null,null,null,null,null,null,null,null,null,196730,0]
[1402006,"Tiroidectomía total ampliada (incluye extirpación de estructuras anatómicas vecinas)",0,null,null,null,null,0,null,null,null,null,null,null,0,null,null,0,null,null,0,null,null,0,null,null,null,null,null,null,null,null,null,null,null,null,490190,0]
[1402007,"Autotransplante de paratiroides (operación asociada a algunas de las prestaciones de tiroides y paratiroides)",0,null,null,null,null,0,null,null,null,null,null,null,0,null,null,0,null,null,0,null,null,0,null,null,null,null,null,null,null,null,null,null,null,null,198920,0]
[1402008,"Paratiroidectomía o exploración paratiroides con exploración de mediastino, abordaje transtorácico.",0,null,null,null,null,0,null,null,null,null,null,null,0,null,null,0,null,null,0,null,null,0,null,null,null,null,null,null,null,null,null,null,null,null,316080,0]
[1402009,"Paratiroidectomía o exploración de paratiroides (abordaje cervical, clásico o mínimamente invasivo)",0,null,null,null,null,0,null,null,null,null,null,null,0,null,null,0,null,null,0,null,null,0,null,null,null,null,null,null,null,null,null,null,null,null,215970,0]
[1402010,"Reexploración cervical paratiroides por persistencia o recidiva hiperparatiroidismo",0,null,null,null,null,0,null,null,null,null,null,null,0,null,null,0,null,null,0,null,null,0,null,null,null,null,null,null,null,null,null,null,null,null,288030,0]
[1402011,"Parotidectomía suprafacial con disección y preservación del nervio facial",0,null,null,null,null,0,null,null,null,null,null,null,0,null,null,0,null,null,0,null,null,0,null,null,null,null,null,null,null,null,null,null,null,null,152020,0]
[1402012,"Parotidectomía total, con disección y preservación del nervio facial.",0,null,null,null,null,0,null,null,null,null,null,null,0,null,null,0,null,null,0,null,null,0,null,null,null,null,null,null,null,null,null,null,null,null,223210,0]
[1402013,"Parotidectomía total ampliada (incluye músculos, ganglios, articulaciones y rama vertical de la mandíbula)",0,null,null,null,null,0,null,null,null,null,null,null,0,null,null,0,null,null,0,null,null,0,null,null,null,null,null,null,null,null,null,null,null,null,466820,0]
[1402014,"Totalización de parotidectomía previa o parotidectomía del lóbulo profundo",0,null,null,null,null,0,null,null,null,null,null,null,0,null,null,0,null,null,0,null,null,0,null,null,null,null,null,null,null,null,null,null,null,null,258930,0]
[1402015,"Sub-mandibulectomía ampliada (incluye piso de la boca, mandíbula, músculos, ganglios y articulaciones)",0,null,null,null,null,0,null,null,null,null,null,null,0,null,null,0,null,null,0,null,null,0,null,null,null,null,null,null,null,null,null,null,null,null,445370,0]
[1402016,"Extirpación de glándula salival submandibular",0,null,null,null,null,0,null,null,null,null,null,null,0,null,null,0,null,null,0,null,null,0,null,null,null,null,null,null,null,null,null,null,null,null,152020,0]
[1402017,"Extirpación glándula sublingual(una o ambas)",0,null,null,null,null,0,null,null,null,null,null,null,0,null,null,0,null,null,0,null,null,0,null,null,null,null,null,null,null,null,null,null,null,null,118920,0]
[1402018,"Extirpación ampliada glándula sublingual (incluye piso de boca, arco mandibular, músculos, ganglios y articulaciones)",0,null,null,null,null,0,null,null,null,null,null,null,0,null,null,0,null,null,0,null,null,0,null,null,null,null,null,null,null,null,null,null,null,null,445370,0]
[1402019,"Absceso parotídeo, sub-maxilar y/o cervical profundo, trat. quir.",0,null,null,null,null,0,null,null,null,null,null,null,null,null,null,null,null,null,null,null,null,null,null,null,null,null,null,null,null,null,null,null,null,null,124000,0]
[1402020,"Conductos salivales de excreción, reimplantación oro-faríngea",0,null,null,null,null,0,null,null,null,null,null,null,0,null,null,0,null,null,0,null,null,0,null,null,null,null,null,null,null,null,null,null,null,null,137580,0]
[1402021,"Cierre de fístula salival: reparación del conducto de excreción",0,null,null,null,null,0,null,null,null,null,null,null,null,null,null,null,null,null,null,null,null,null,null,null,null,null,null,null,null,null,null,null,null,null,124000,0]
[1402022,"Extirpación de quiste o mucocele de glándula salival menor de labios",0,null,null,null,null,0,null,null,null,null,null,null,null,null,null,null,null,null,null,null,null,null,null,null,null,null,null,null,null,null,null,null,null,null,65300,0]
[1402023,"Tratamiento quirúrgico Torticolis Congénita",0,null,null,null,null,0,null,null,null,null,null,null,0,null,null,0,null,null,0,null,null,0,null,null,null,null,null,null,null,null,null,null,null,null,146540,0]
[1402024,"Quistes y/o fístulas del conducto tirogloso, y/o branquial, y/o higroma, y/o fístula preauricular complicada, y/u otros quistes y/o tumores benignos, trat. quir.",0,null,null,null,null,0,null,null,null,null,null,null,0,null,null,0,null,null,0,null,null,0,null,null,null,null,null,null,null,null,null,null,null,null,146540,0]
[1402025,"Tumores del cuerpo carotídeo, trat. quir. (incl. proc. vascular)",0,null,null,null,null,0,null,null,null,null,null,null,0,null,null,0,null,null,0,null,null,0,null,null,null,null,null,null,null,null,null,null,null,null,198850,0]
[1402026,"Biopsia quir., mucosa oronasofaríngea (proc. aut.)",0,null,null,null,null,0,null,null,null,null,null,null,null,null,null,null,null,null,null,null,null,null,null,null,null,null,null,null,null,null,null,null,null,null,20990,0]
[1402027,"Biopsia quir., piel  y mucosa cara (proc. aut.)",0,null,null,null,null,0,null,null,null,null,null,null,null,null,null,null,null,null,null,null,null,null,null,null,null,null,null,null,null,null,null,null,null,null,25670,0]
[1402028,"Resección cutánea ampliada (incluye musculatura, ganglios y huesos subyacentes; desplazamiento de colgajos)",0,null,null,null,null,0,null,null,null,null,null,null,0,null,null,0,null,null,0,null,null,0,null,null,null,null,null,null,null,null,null,null,null,null,152020,0]
[1402029,"Resección cutánea simple (sutura primaria)",0,null,null,null,null,0,null,null,null,null,null,null,null,null,null,null,null,null,null,null,null,null,null,null,null,null,null,null,null,null,null,null,null,null,35950,0]
[1402030,"Tumor maligno de labio superior o inferior, resección total del labio y cirugía reparadora",0,null,null,null,null,0,null,null,null,null,null,null,0,null,null,0,null,null,0,null,null,0,null,null,null,null,null,null,null,null,null,null,null,null,175880,0]
[1402031,"Tumor maligno de labio superior o inferior, resección parcial del labio y cirugía reparadora",0,null,null,null,null,0,null,null,null,null,null,null,0,null,null,0,null,null,0,null,null,0,null,null,null,null,null,null,null,null,null,null,null,null,152020,0]
[1402032,"Resección parcial y cirugía reparadora",0,null,null,null,null,0,null,null,null,null,null,null,0,null,null,0,null,null,0,null,null,0,null,null,null,null,null,null,null,null,null,null,null,null,137580,0]
[1402033,"Resección total y cirugía reparadora",0,null,null,null,null,0,null,null,null,null,null,null,0,null,null,0,null,null,0,null,null,0,null,null,null,null,null,null,null,null,null,null,null,null,152020,{"$f":"AK1445*I1445","v":0}]
[1402034,"Extirpación ampliada de nariz incluyendo parte esqueleto facial (naso-etmoidiana)",0,null,null,null,null,0,null,null,null,null,null,null,0,null,null,0,null,null,0,null,null,0,null,null,null,null,null,null,null,null,null,null,null,null,216700,0]
[1402035,"Exanteración orbitaria ampliada (incluye etmoides, hueso frontal, base de cráneo anterior y región máxilo-malar)",0,null,null,null,null,0,null,null,null,null,null,null,0,null,null,0,null,null,0,null,null,0,null,null,null,null,null,null,null,null,null,null,null,null,555860,0]
[1402036,"Extirpacion total ampliada del hueso temporal",0,null,null,null,null,0,null,null,null,null,null,null,0,null,null,0,null,null,0,null,null,0,null,null,null,null,null,null,null,null,null,null,null,null,527440,0]
[1402037,"Maxilectomia parcial y reparación protésica",0,null,null,null,null,0,null,null,null,null,null,null,0,null,null,0,null,null,0,null,null,0,null,null,null,null,null,null,null,null,null,null,null,null,188450,0]
[1402038,"Parcial (incluye paladar óseo; reparación con colgajo)",0,null,null,null,null,0,null,null,null,null,null,null,0,null,null,0,null,null,0,null,null,0,null,null,null,null,null,null,null,null,null,null,null,null,230110,0]
[1402039,"Radical ampliada (incluye exanteración orbitaria y de fosa craneal anterior o media)",0,null,null,null,null,0,null,null,null,null,null,null,0,null,null,0,null,null,0,null,null,0,null,null,null,null,null,null,null,null,null,null,null,null,555860,0]
[1402040,"Radical clásica (incluye exanteración orbitaria y reparación con colgajo)",0,null,null,null,null,0,null,null,null,null,null,null,0,null,null,0,null,null,0,null,null,0,null,null,null,null,null,null,null,null,null,null,null,null,505470,0]
[1402041,"Radical clásica (incluye exanteración orbitaria y reparación protésica)",0,null,null,null,null,0,null,null,null,null,null,null,0,null,null,0,null,null,0,null,null,0,null,null,null,null,null,null,null,null,null,null,null,null,453470,0]
[1402042,"Glosectomía parcial, reparación primaria",0,null,null,null,null,0,null,null,null,null,null,null,0,null,null,0,null,null,0,null,null,0,null,null,null,null,null,null,null,null,null,null,null,null,123950,0]
[1402043,"Resección amplia de tumor maligno y disección ganglionar cervical",0,null,null,null,null,0,null,null,null,null,null,null,0,null,null,0,null,null,0,null,null,0,null,null,null,null,null,null,null,null,null,null,null,null,429870,0]
[1402044,"Hemimandibulectomía",0,null,null,null,null,0,null,null,null,null,null,null,0,null,null,0,null,null,0,null,null,0,null,null,null,null,null,null,null,null,null,null,null,null,221670,0]
[1402045,"Mandibulectomía total",0,null,null,null,null,0,null,null,null,null,null,null,0,null,null,0,null,null,0,null,null,0,null,null,null,null,null,null,null,null,null,null,null,null,372200,0]
[1402046,"Operación \"comando\" (incluye extirp. del tumor, hemimandibulectomía y disección ganglionar radical de cuello)",0,null,null,null,null,0,null,null,null,null,null,null,0,null,null,0,null,null,0,null,null,0,null,null,null,null,null,null,null,null,null,null,null,null,611900,0]
[1402047,"Resección parcial de mandíbula",0,null,null,null,null,0,null,null,null,null,null,null,0,null,null,0,null,null,0,null,null,0,null,null,null,null,null,null,null,null,null,null,null,null,143100,0]
[1402048,"Extirpación de tumor intraoral amplia en tercio posterior cavidad oral (región faringea) ",0,null,null,null,null,0,null,null,null,null,null,null,0,null,null,0,null,null,0,null,null,0,null,null,null,null,null,null,null,null,null,null,null,null,517100,0]
[1402050,"Faringectomía parcial",0,null,null,null,null,0,null,null,null,null,null,null,0,null,null,0,null,null,0,null,null,0,null,null,null,null,null,null,null,null,null,null,null,null,152020,0]
[1402051,"Genioplastía",0,null,null,null,null,0,null,null,null,null,null,null,0,null,null,0,null,null,0,null,null,0,null,null,null,null,null,null,null,null,null,null,null,null,146540,0]
[1402052,"Osteotomias segmentarias del maxilar o mandíbula",0,null,null,null,null,0,null,null,null,null,null,null,0,null,null,0,null,null,0,null,null,0,null,null,null,null,null,null,null,null,null,null,null,null,152020,0]
[1402053,"Osteotomias totales del maxilar o mandibula (tipo Le Fort I o sagital de rama)",0,null,null,null,null,0,null,null,null,null,null,null,0,null,null,0,null,null,0,null,null,0,null,null,null,null,null,null,null,null,null,null,null,null,235180,0]
[1402054,"Reducción cerrada de fracturas maxilofaciales",0,null,null,null,null,0,null,null,null,null,null,null,null,null,null,null,null,null,null,null,null,null,null,null,null,null,null,null,null,null,null,null,null,null,65250,0]
[1402055,"Reduccion abierta de fracturas maxilofaciales y estabilizacion con elementos de osteosintesis,",0,null,null,null,null,0,null,null,null,null,null,null,0,null,null,0,null,null,0,null,null,0,null,null,null,null,null,null,null,null,null,null,null,null,161800,0]
[1402056,"Reducción abierta de fracturas maxilofaciales con osteosintesis única,",0,null,null,null,null,0,null,null,null,null,null,null,null,null,null,null,null,null,null,null,null,null,null,null,null,null,null,null,null,null,null,null,null,null,135950,0]
[1402057,"Reconstrucciones complejas de la cara simultáneas con proc. neuroquirúrgico (craneotomías más abordajes y trat. facial), tiempo facial",0,null,null,null,null,0,null,null,null,null,null,null,0,null,null,0,null,null,0,null,null,0,null,null,null,null,null,null,null,null,null,null,null,null,453470,0]
[1402058,"Reconstrucciones de partes duras y blandas de la cara, mediante abordajes múltiples y hemicoronal o coronal",0,null,null,null,null,0,null,null,null,null,null,null,0,null,null,0,null,null,0,null,null,0,null,null,null,null,null,null,null,null,null,null,null,null,284570,0]
[1402059,"Remoción de arcos dentarios o ligaduras de alambre ",0,null,null,null,null,0,null,null,null,null,null,null,null,null,null,null,null,null,null,null,null,null,null,null,null,null,null,null,null,null,null,null,null,null,45460,0]
[1402060,"Reducción simple fractura maxilo facial (proc. aut.)",0,null,null,null,null,0,null,null,null,null,null,null,null,null,null,null,null,null,null,null,null,null,null,null,null,null,null,null,null,null,null,null,null,null,39050,0]
[null,"TOTAL",{"$f":"SUM(C1413:C1471)","v":0},null,null,null,null,{"$f":"SUM(H1413:H1471)","v":0},0,0,0,0,0,0,0,0,0,0,0,0,0,0,0,0,0,0,0,0,0,0,0,0,0,0,0,0,14448900,0]
[null,"GRUPO 15 : CIRUGIA PLASTICA Y REPARADORA     ",{"$f":"AK1473*E1473","v":0}]
[null,"CIRUGIA PLASTICA Y REPARADORA                               "]
[1502001,"Heridas de la cara Complicadas: 1 o varias de más de 5 cms. y/o ubicadas en bordes de párpados, labios o ala nasal y/o que comprometen músculos, conductos, vasos o nervios",{"$f":"SUM(I1475:N1475)","v":0},null,null,null,null,{"$f":"+I1475+J1475","v":0},null,null,null,null,null,null,null,null,null,null,null,null,null,null,null,null,null,null,null,null,null,null,null,null,null,null,null,null,107860,{"$f":"AK1475*I1475","v":0}]
[1502002,"Heridas de la cara- Simples: 1 o varias de hasta 5 cms. que sólo comprometen piel",{"$f":"SUM(I1476:N1476)","v":0},null,null,null,null,0,null,null,null,null,null,null,null,null,null,null,null,null,null,null,null,null,null,null,null,null,null,null,null,null,null,null,null,null,30400,0]
[1502003,"Implante de silicona facial (cualquier zona o zonas)",{"$f":"SUM(I1477:N1477)","v":0},null,null,null,null,0,null,null,null,null,null,null,null,null,null,null,null,null,null,null,null,null,null,null,null,null,null,null,null,null,null,null,null,null,84460,0]
[1502004,"Resección plástica de hasta 2 cicatrices (cualquier localización o tamaño)",0,null,null,null,null,0,null,null,null,null,null,null,null,null,null,null,null,null,null,null,null,null,null,null,null,null,null,null,null,null,null,null,null,null,101430,0]
[1502005,"Cicatrices (cualquier localización o tamaño), resecc. plástica de (proc. aut.)- 3 y más",0,null,null,null,null,0,null,null,null,null,null,null,null,null,null,null,null,null,null,null,null,null,null,null,null,null,null,null,null,null,null,null,null,null,118240,0]
[1502006,"Resección plástica de 3 o más cicatrices (cualquier localización o tamaño) ",0,null,null,null,null,0,null,null,null,null,null,null,null,null,null,null,null,null,null,null,null,null,null,null,null,null,null,null,null,null,null,null,null,null,31270,0]
[1502007,"Injertos piel parcial y/o mucosa- Hasta 5% superficie corporal receptora",0,null,null,null,null,0,null,null,null,null,null,null,null,null,null,null,null,null,null,null,null,null,null,null,null,null,null,null,null,null,null,null,null,null,50680,0]
[1502008,"Injertos hasta 10% superficie corporal receptora",0,null,null,null,null,0,null,null,null,null,null,null,{"$f":"SUM(P1482:Q1482)","v":0},null,null,{"$f":"SUM(S1482:T1482)","v":0},null,null,{"$f":"SUM(V1482:W1482)","v":0},null,null,{"$f":"SUM(Y1482:Z1482)","v":0},null,null,null,null,null,null,null,null,null,null,null,null,89000,0]
[1502009,"Injertos piel parcial y/o mucosa- Por cada 10% (o su fracción) adicional hasta 50%",0,null,null,null,null,0,null,null,null,null,null,null,0,null,null,0,null,null,0,null,null,0,null,null,null,null,null,null,null,null,null,null,null,null,59000,0]
[1502010,"Injertos piel parcial y/o mucosa- 51% y más de superficie corporal receptora",0,null,null,null,null,0,null,null,null,null,null,null,0,null,null,0,null,null,0,null,null,0,null,null,null,null,null,null,null,null,null,null,null,null,344540,0]
[1502011,"Piel total, cualquier tamaño (incluye tratamiento zona dadora y receptora)",0,null,null,null,null,0,null,null,null,null,null,null,0,null,null,0,null,null,0,null,null,0,null,null,null,null,null,null,null,null,null,null,null,null,154340,0]
[1502012,"Toma de injertos- Cartílago (auricular, costal o similares) c/u",0,null,null,null,null,0,null,null,null,null,null,null,null,null,null,null,null,null,null,null,null,null,null,null,null,null,null,null,null,null,null,null,null,null,107860,0]
[1502013,"Toma de injertos-óseo (costal, ilíaco, tibial o similares) c/u.",0,null,null,null,null,0,null,null,null,null,null,null,0,null,null,0,null,null,0,null,null,0,null,null,null,null,null,null,null,null,null,null,null,null,138150,0]
[1502014,"Plastías en Z- Hasta 3",0,null,null,null,null,0,null,null,null,null,null,null,null,null,null,null,null,null,null,null,null,null,null,null,null,null,null,null,null,null,null,null,null,null,107860,0]
[1502015,"Plastías en Z- 4 y más",0,null,null,null,null,0,null,null,null,null,null,null,0,null,null,0,null,null,0,null,null,0,null,null,null,null,null,null,null,null,null,null,null,null,137580,0]
[1502016,"Colgajos complejos (Abbe, Mustarda, Converse, Juri, Bakamjian o similar)",0,null,null,null,null,0,null,null,null,null,null,null,0,null,null,0,null,null,0,null,null,0,null,null,null,null,null,null,null,null,null,null,null,null,183230,0]
[1502017,"Colgajos libres con microanastomosis (incluye toma del colgajo y las suturas neurovasculares)",0,null,null,null,null,0,null,null,null,null,null,null,0,null,null,0,null,null,0,null,null,0,null,null,null,null,null,null,null,null,null,null,null,null,487620,0]
[1502018,"Colgajos musculares o musculocutáneos",0,null,null,null,null,0,null,null,null,null,null,null,0,null,null,0,null,null,0,null,null,0,null,null,null,null,null,null,null,null,null,null,null,null,250780,0]
[1502019,"Colgajos osteomusculocutáneos",0,null,null,null,null,0,null,null,null,null,null,null,0,null,null,0,null,null,0,null,null,0,null,null,null,null,null,null,null,null,null,null,null,null,372560,0]
[1502020,"Colgajos simples dos o más",0,null,null,null,null,0,null,null,null,null,null,null,0,null,null,0,null,null,0,null,null,0,null,null,null,null,null,null,null,null,null,null,null,null,152020,0]
[1502021,"Colgajo simple único",0,null,null,null,null,0,null,null,null,null,null,null,0,null,null,0,null,null,0,null,null,0,null,null,null,null,null,null,null,null,null,null,null,null,104620,0]
[1502022,"Parálisis facial, trasplantes musculares",0,null,null,null,null,0,null,null,null,null,null,null,0,null,null,0,null,null,0,null,null,0,null,null,null,null,null,null,null,null,null,null,null,null,207120,0]
[1502023,"Ridectomía- Cérvico-facial, un lado",0,null,null,null,null,0,null,null,null,null,null,null,0,null,null,0,null,null,0,null,null,0,null,null,null,null,null,null,null,null,null,null,null,null,165480,0]
[1502024,"Ridectomía- Frontal",0,null,null,null,null,0,null,null,null,null,null,null,0,null,null,0,null,null,0,null,null,0,null,null,null,null,null,null,null,null,null,null,null,null,143100,0]
[1502025,"Aladas o en asa, corrección plástica",0,null,null,null,null,0,null,null,null,null,null,null,null,null,null,null,null,null,null,null,null,null,null,null,null,null,null,null,null,null,null,null,null,null,130580,0]
[1502026,"Lóbulo auricular partido, corrección plástica (proc. aut)",0,null,null,null,null,0,null,null,null,null,null,null,null,null,null,null,null,null,null,null,null,null,null,null,null,null,null,null,null,null,null,null,null,null,31270,0]
[1502027,"Malformación congénita compleja, cada plastía o plastías en tiempos diferentes",0,null,null,null,null,0,null,null,null,null,null,null,0,null,null,0,null,null,0,null,null,0,null,null,null,null,null,null,null,null,null,null,null,null,143100,0]
[1502028,"Corrección nasal parcial (alares, alargamiento columela o similar)",0,null,null,null,null,0,null,null,null,null,null,null,0,null,null,0,null,null,0,null,null,0,null,null,null,null,null,null,null,null,null,null,null,null,137580,0]
[1502029,"Blefaroplastía uno o ambos párpados:- Inferiores",0,null,null,null,null,0,null,null,null,null,null,null,0,null,null,0,null,null,0,null,null,0,null,null,null,null,null,null,null,null,null,null,null,null,143100,0]
[1502030,"Blefaroplastía uno o ambos párpados:- Superiores",0,null,null,null,null,0,null,null,null,null,null,null,0,null,null,0,null,null,0,null,null,0,null,null,null,null,null,null,null,null,null,null,null,null,144590,0]
[1502031,"Corrección quirúrgica secundaria de queiloplastía",0,null,null,null,null,0,null,null,null,null,null,null,0,null,null,0,null,null,0,null,null,0,null,null,null,null,null,null,null,null,null,null,null,null,143100,0]
[1502032,"Queiloplastía primaria, un lado (proc. quir. completo por cualquier técnica)",0,null,null,null,null,0,null,null,null,null,null,null,0,null,null,0,null,null,0,null,null,0,null,null,null,null,null,null,null,null,null,null,null,null,143100,0]
[1502033,"Cierre de paladar duro y/o cierre de comunicación oro-nasal",0,null,null,null,null,0,null,null,null,null,null,null,0,null,null,0,null,null,0,null,null,0,null,null,null,null,null,null,null,null,null,null,null,null,143100,{"$f":"AK1507*I1507","v":0}]
[1502034,"Cierre mucoso vestíbulo oral o gingivo-periostio-plastia ",0,null,null,null,null,0,null,null,null,null,null,null,0,null,null,0,null,null,0,null,null,0,null,null,null,null,null,null,null,null,null,null,null,null,143100,0]
[1502035,"Plastía de velo (cualquier técnica)",0,null,null,null,null,0,null,null,null,null,null,null,0,null,null,0,null,null,0,null,null,0,null,null,null,null,null,null,null,null,null,null,null,null,143100,0]
[1502036,"Cierre de macrostomía, un lado",0,null,null,null,null,0,null,null,null,null,null,null,0,null,null,0,null,null,0,null,null,0,null,null,null,null,null,null,null,null,null,null,null,null,137580,0]
[1502037,"Tratamiento quirurgico de anomalías cráneo faciales",0,null,null,null,null,0,null,null,null,null,null,null,0,null,null,0,null,null,0,null,null,0,null,null,null,null,null,null,null,null,null,null,null,null,256020,0]
[1502038,"Reconst. Osteopl.reborde alveolar- Bilateral en un tiempo",0,null,null,null,null,0,null,null,null,null,null,null,0,null,null,0,null,null,0,null,null,0,null,null,null,null,null,null,null,null,null,null,null,null,207120,0]
[1502039,"Reconst. Osteopl.reborde alveolar - Unilateral",0,null,null,null,null,0,null,null,null,null,null,null,0,null,null,0,null,null,0,null,null,0,null,null,null,null,null,null,null,null,null,null,null,null,151390,0]
[1502040,"Distoplasias orbitarias: movilización unilateral o vertical tiempo facial",0,null,null,null,null,0,null,null,null,null,null,null,0,null,null,0,null,null,0,null,null,0,null,null,null,null,null,null,null,null,null,null,null,null,475500,0]
[1502041,"Expansión o reconstrucción de un micro-orbitismo",0,null,null,null,null,0,null,null,null,null,null,null,0,null,null,0,null,null,0,null,null,0,null,null,null,null,null,null,null,null,null,null,null,null,475500,0]
[1502042,"Síndrome de Apert Crouzon o similar: avance fronto-órbito-maxilar vía intracraneana, tiempo facial",0,null,null,null,null,0,null,null,null,null,null,null,0,null,null,0,null,null,0,null,null,0,null,null,null,null,null,null,null,null,null,null,null,null,555860,0]
[1502043,"Síndrome de Apert Crouzon o similar: osteotomía tipo Le Fort III o similar",0,null,null,null,null,0,null,null,null,null,null,null,0,null,null,0,null,null,0,null,null,0,null,null,null,null,null,null,null,null,null,null,null,null,555860,0]
[1502044,"Corrección telecanto",0,null,null,null,null,0,null,null,null,null,null,null,0,null,null,0,null,null,0,null,null,0,null,null,null,null,null,null,null,null,null,null,null,null,165480,0]
[1502045,"Movilización orbitaria extracraneana",0,null,null,null,null,0,null,null,null,null,null,null,0,null,null,0,null,null,0,null,null,0,null,null,null,null,null,null,null,null,null,null,null,null,475500,0]
[1502046,"Movilización orbitaria intracraneana, tiempo facial",0,null,null,null,null,0,null,null,null,null,null,null,0,null,null,0,null,null,0,null,null,0,null,null,null,null,null,null,null,null,null,null,null,null,580710,0]
[1502047,"Ginecomastía, corrección plástica",0,null,null,null,null,0,null,null,null,null,null,null,0,null,null,0,null,null,0,null,null,0,null,null,null,null,null,null,null,null,null,null,null,null,138150,0]
[1502048,"Mamoplastía de aumento (unilateral)",0,null,null,null,null,0,null,null,null,null,null,null,0,null,null,0,null,null,0,null,null,0,null,null,null,null,null,null,null,null,null,null,null,null,146540,0]
[1502049,"Mamoplastía de reducción",0,null,null,null,null,0,null,null,null,null,null,null,0,null,null,0,null,null,0,null,null,0,null,null,null,null,null,null,null,null,null,null,null,null,178190,0]
[1502050,"Mastopexia c/s implante de prótesis (no incluye valor de la prótesis)",0,null,null,null,null,0,null,null,null,null,null,null,0,null,null,0,null,null,0,null,null,0,null,null,null,null,null,null,null,null,null,null,null,null,147080,0]
[1502051,"Reconstrucción areola y/o pezón c/s plastía (proc. aut.)",0,null,null,null,null,0,null,null,null,null,null,null,0,null,null,0,null,null,0,null,null,0,null,null,null,null,null,null,null,null,null,null,null,null,114990,0]
[1502052,"Reconstrucción mamaria",0,null,null,null,null,0,null,null,null,null,null,null,0,null,null,0,null,null,0,null,null,0,null,null,null,null,null,null,null,null,null,null,null,null,209190,0]
[1502053,"Abdominoplastia",0,null,null,null,null,0,null,null,null,null,null,null,0,null,null,0,null,null,0,null,null,0,null,null,null,null,null,null,null,null,null,null,null,null,203440,0]
[1502054,"Con resección ósea c/s colgajo de rotación",0,null,null,null,null,0,null,null,null,null,null,null,0,null,null,0,null,null,0,null,null,0,null,null,null,null,null,null,null,null,null,null,null,null,159630,0]
[1502055,"Con resección ósea y colgajos musculares o musculocutáneos",0,null,null,null,null,0,null,null,null,null,null,null,0,null,null,0,null,null,0,null,null,0,null,null,null,null,null,null,null,null,null,null,null,null,256020,0]
[1502056,"Sindactilia, trat. quir. cada espacio- con injerto",0,null,null,null,null,0,null,null,null,null,null,null,0,null,null,0,null,null,0,null,null,0,null,null,null,null,null,null,null,null,null,null,null,null,114990,0]
[1502057,"Sindactilia, trat. quir. cada espacio- Sin injerto",0,null,null,null,null,0,null,null,null,null,null,null,null,null,null,null,null,null,null,null,null,null,null,null,null,null,null,null,null,null,null,null,null,null,50680,0]
[1502058,"Polidactilia, extirpación y plastía un lado",0,null,null,null,null,0,null,null,null,null,null,null,0,null,null,0,null,null,0,null,null,0,null,null,null,null,null,null,null,null,null,null,null,null,114990,0]
[1502059,"Lipectomía glútea, un lado",0,null,null,null,null,0,null,null,null,null,null,null,0,null,null,0,null,null,0,null,null,0,null,null,null,null,null,null,null,null,null,null,null,null,123950,0]
[1502060,"Lipectomía trocánterea, un lado",0,null,null,null,null,0,null,null,null,null,null,null,0,null,null,0,null,null,0,null,null,0,null,null,null,null,null,null,null,null,null,null,null,null,123950,0]
[1502061,"Escarotomía- Hasta 10 % superficie corporal",0,null,null,null,null,0,null,null,null,null,null,null,null,null,null,null,null,null,null,null,null,null,null,null,null,null,null,null,null,null,null,null,null,null,30940,0]
[1502062,"Escarotomía- Por cada 10 % adicional (o su fracción)",0,null,null,null,null,0,null,null,null,null,null,null,null,null,null,null,null,null,null,null,null,null,null,null,null,null,null,null,null,null,null,null,null,null,20990,0]
[1502063,"Escarectomía- Hasta 1 % superficie corporal",0,null,null,null,null,0,null,null,null,null,null,null,null,null,null,null,null,null,null,null,null,null,null,null,null,null,null,null,null,null,null,null,null,null,44240,0]
[1502064,"Escarectomía- Hasta 5 % superficie corporal",0,null,null,null,null,0,null,null,null,null,null,null,null,null,null,null,null,null,null,null,null,null,null,null,null,null,null,null,null,null,null,null,null,null,66280,0]
[1502065,"Escarectomía- Hasta 10% superficie corporal",0,null,null,null,null,{"$f":"+I1539+J1539","v":0},null,null,null,null,null,null,0,null,null,0,null,null,0,null,null,0,null,null,null,null,null,null,null,null,null,null,null,null,118920,{"$f":"AK1539*I1539","v":0}]
[1502066,"Escarectomía- Por cada 10% adicional (o su fracción)",0,null,null,null,null,0,null,null,null,null,null,null,0,null,null,0,null,null,0,null,null,0,null,null,null,null,null,null,null,null,null,null,null,null,71990,0]
[null,"TOTAL",{"$f":"SUM(C1475:C1540)","v":0},null,null,null,null,{"$f":"SUM(H1475:H1540)","v":0},0,0,0,0,0,0,0,0,0,0,0,0,0,0,0,0,0,0,0,0,0,0,0,0,0,0,0,0,11646590,0]
[null,"DERMATOLOGIA Y TEGUMENTOS"]
[1601110,"Curetaje de lesiones virales o similares hasta 10 lesiones                          ",{"$f":"SUM(D1543+G1543)","v":0},{"$f":"SUM(E1543:F1543)","v":0}]
[1601111,"Aplicación de inmunomodulares, quimicos y similares hasta 10 lesiones",{"$f":"SUM(D1544+G1544)","v":0},{"$f":"SUM(E1544:F1544)","v":0}]
[1601112,"Fototerapia UVB, UVA localizada, por sesion ",0,0]
[1601113,"Fototerapia UVB, banda angosta y UVA por sesion  en cabina",0,0]
[1601115,"Implantes Subcutáneos, instalación o retiro                                                                  ",0,0]
[1601116,"Crioterapia hasta 5 lesiones",0,0]
[1601117,"Crioterapia 6 a 10 lesiones",0,0]
[1601118,"Tumor maligno por criocirugia (por cada lesion)",0,0]
[1601119,"Inyeccion intracutanea en areas hasta 9 cms2",0,0]
[1601120,"Tratamiento abrasivo cutaneo mecanico",0,0]
[1601121,"Tratamiento abrasivo cutaneo  quimico",0,0]
[1601122,"Tricograma",0,0]
[1601124,"Tratamiento por laser, IPL o similar por area hasta 16 cm2",0,0]
[1601125,"Terapia fotodinamica ( no incluye medicamento)",0,0]
[1601126,"Dermatoscopia digital con registro graficos hasta 5 lesiones ",0,0]
[" 5099053 ","Curetaje de lesiones y similares hasta 10 lesiones ",0,0]
[null,"TOTAL",{"$f":"SUM(C1543:C1558)","v":0},{"$f":"SUM(D1543:D1558)","v":0},0,0,0,null,null,null,null,null,null,null,null,null,null,null,null,null,null,null,null,null,null,null,{"$f":"SUM(AA1543:AA1558)","v":0},{"$f":"SUM(AB1543:AB1558)","v":0},0,0,0,0,0,0,0,0]
[null,"GRUPO 16 : DERMATOLOGIA Y TEGUMENTOS       "]
[null,"INTERVENCIONES QUIRURGICAS DE TEGUMENTOS                    "]
[1602201,"Biopsia de piel y/o mucosa por curetaje o sección tangencial c/s electro x 1 sesion        ",{"$f":"SUM(I1562:N1562)","v":0},null,null,null,null,{"$f":"+I1562+J1562","v":0},null,null,null,null,null,null,null,null,null,null,null,null,null,null,null,null,null,null,null,null,null,null,null,null,null,null,null,null,34110,{"$f":"AK1562*I1562","v":0}]
[1602202,"Extirpacion de, reparacion o biopsia total o parcial, de lesiones benignas cutáneas por excision cabeza, cuello, genitales, hasta 3 lesiones                                                                  ",{"$f":"SUM(I1563:N1563)","v":0},null,null,null,null,0,null,null,null,null,null,null,null,null,null,null,null,null,null,null,null,null,null,null,null,null,null,null,null,null,null,null,null,null,60190,0]
[1602203,"Extirpacion de, reparacion o biopsia total o parcial, de lesiones benignas cutáneas por excision resto de cuerpo hasta 3 lesiones                                                                              ",{"$f":"SUM(I1564:N1564)","v":0},null,null,null,null,0,null,null,null,null,null,null,null,null,null,null,null,null,null,null,null,null,null,null,null,null,null,null,null,null,null,null,null,null,40130,0]
[1602204,"Extirpacion de, reparacion o biopsia total o parcial, de lesiones benignas cutáneas por excision cabeza, cuello, genitales, desde 4 hasta 6 lesiones                                              ",0,null,null,null,null,0,null,null,null,null,null,null,null,null,null,null,null,null,null,null,null,null,null,null,null,null,null,null,null,null,null,null,null,null,120390,0]
[1602205,"Extirpacion de, reparacion o biopsia total o parcial, de lesiones benignas cutáneas por excision resto de cuerpo desde 4 hasta 6 lesiones                                                             ",0,null,null,null,null,0,null,null,null,null,null,null,null,null,null,null,null,null,null,null,null,null,null,null,null,null,null,null,null,null,null,null,null,null,80250,0]
[1602206,"Extirpacion de lesiones benignas por sec tangencial ,curetaje,y/o fulguracion hasta 15 lesiones   ",0,null,null,null,null,0,null,null,null,null,null,null,null,null,null,null,null,null,null,null,null,null,null,null,null,null,null,null,null,null,null,null,null,null,40130,0]
[1602207,"Tratamiento por electro de hemangiomas o telangectasias hasta 15 lesiones",0,null,null,null,null,0,null,null,null,null,null,null,null,null,null,null,null,null,null,null,null,null,null,null,null,null,null,null,null,null,null,null,null,null,40130,0]
[1602211,"Cabeza, cuello, genitales: tratamiento quirúrgico de tumor maligno por escisión total o parcial, con o sin sutura, por cada lesión o melanoma cualquier localización",0,null,null,null,null,0,null,null,null,null,null,null,null,null,null,null,null,null,null,null,null,null,null,null,null,null,null,null,null,null,null,null,null,null,125410,0]
[1602212,"Resto del cuerpo: tratamiento quirúrgico de tumor maligno por escisión total o parcial, con o sin sutura, por cada lesión",0,null,null,null,null,0,null,null,null,null,null,null,null,null,null,null,null,null,null,null,null,null,null,null,null,null,null,null,null,null,null,null,null,null,100320,0]
[1602213,"Cabeza, cuello, genitales o melanoma cualquier ubicación: ampliación de márgenes quirúrgicos de tumor maligno extirpado previamente ",0,null,null,null,null,0,null,null,null,null,null,null,null,null,null,null,null,null,null,null,null,null,null,null,null,null,null,null,null,null,null,null,null,null,100320,0]
[1602214,"Resto del cuerpo: ampliación de márgenes quirúrgicos de tumor maligno extirpado prevíamente",0,null,null,null,null,0,null,null,null,null,null,null,null,null,null,null,null,null,null,null,null,null,null,null,null,null,null,null,null,null,null,null,null,null,75240,0]
[1602215,"Tumores vasculares profundos cara, cuero cabelludo, cuello, genitales",0,null,null,null,null,0,null,null,null,null,null,null,null,null,null,null,null,null,null,null,null,null,null,null,null,null,null,null,null,null,null,null,null,null,125410,0]
[1602216,"Tumores vasculares profundos resto del cuerpo",0,null,null,null,null,0,null,null,null,null,null,null,null,null,null,null,null,null,null,null,null,null,null,null,null,null,null,null,null,null,null,null,null,null,100320,0]
[1602221,"Herida cortante o contusa complicada, reparación y sutura (más de 5 cm)",0,null,null,null,null,0,null,null,null,null,null,null,null,null,null,null,null,null,null,null,null,null,null,null,null,null,null,null,null,null,null,null,null,null,57290,0]
[1602222,"Herida cortante o contusa NO complicada, reparacion y sutura (una o multiples de mas de 5 cms de largo total y/o que comprometa solo piel)                                                                             ",0,null,null,null,null,0,null,null,null,null,null,null,null,null,null,null,null,null,null,null,null,null,null,null,null,null,null,null,null,null,null,null,null,null,15430,0]
[1602223,"Cabeza, cuello, genitales: extirpación de lesión benigna subepidérmica, incluye tumor sólido, quiste epidérmico y lipoma por lesión ",0,null,null,null,null,0,null,null,null,null,null,null,null,null,null,null,null,null,null,null,null,null,null,null,null,null,null,null,null,null,null,null,null,null,75240,0]
[1602224,"Resto del cuerpo: extirpación de lesión benigna subepidérmica, incluye tumor sólido, quiste epidérmico y lipoma por lesión ",0,null,null,null,null,0,null,null,null,null,null,null,null,null,null,null,null,null,null,null,null,null,null,null,null,null,null,null,null,null,null,null,null,null,62690,0]
[1602225,"Vaciamiento y curetaje quirurgico de lesiones quistica o abscesos                              ",0,null,null,null,null,0,null,null,null,null,null,null,null,null,null,null,null,null,null,null,null,null,null,null,null,null,null,null,null,null,null,null,null,null,40130,0]
[1602231,"Onisectomia total o parcial simple                                                                                      ",0,null,null,null,null,0,null,null,null,null,null,null,null,null,null,null,null,null,null,null,null,null,null,null,null,null,null,null,null,null,null,null,null,null,16040,0]
[1602232,"Cirugia reparadora ungueal por proceso inflamatorio                                                                 ",0,null,null,null,null,0,null,null,null,null,null,null,null,null,null,null,null,null,null,null,null,null,null,null,null,null,null,null,null,null,null,null,null,null,50170,0]
[1602233,"Correccion quirurgica de defecto congenito o por tumor ungueal",0,null,null,null,null,0,null,null,null,null,null,null,null,null,null,null,null,null,null,null,null,null,null,null,null,null,null,null,null,null,null,null,null,null,80250,0]
[1602240,"Curacion por medico, quemadura o similar menor al 5% superficie corporal en pabellon       ",0,null,null,null,null,0,null,null,null,null,null,null,null,null,null,null,null,null,null,null,null,null,null,null,null,null,null,null,null,null,null,null,null,null,11140,0]
[1602241,"Curacion por medico, quemadura o similar  5 a 10% superficie corporal en pabellon        ",0,null,null,null,null,0,null,null,null,null,null,null,null,null,null,null,null,null,null,null,null,null,null,null,null,null,null,null,null,null,null,null,null,null,20060,0]
[1602242,"Curacion por medico, quemadura o similar  mayor  al 10% superficie corporal en pabellon",0,null,null,null,null,0,null,null,null,null,null,null,{"$f":"SUM(P1585:Q1585)","v":0},null,null,{"$f":"SUM(S1585:T1585)","v":0},null,null,{"$f":"SUM(V1585:W1585)","v":0},null,null,{"$f":"SUM(Y1585:Z1585)","v":0},null,null,null,null,null,null,null,null,null,null,null,null,36110,0]
[null,"TOTAL",{"$f":"SUM(C1562:C1585)","v":0},null,null,null,null,{"$f":"SUM(H1562:H1585)","v":0},0,0,0,0,0,0,0,0,0,0,0,0,0,0,0,0,0,0,0,0,0,0,0,0,0,0,0,0,1506900,0]
["GRUPO 17: PROCEDIM.CARDIOLOGIA, NEUMOLOG., CARDIOVASC. Y TORAX    "]
[1701002,"Electrocardiograma esofagico",{"$f":"SUM(D1588+G1588)","v":0},{"$f":"SUM(E1588:F1588)","v":0}]
[1701004,"Electrocardiograma de esfuerzo en adultos o ninos",0,0]
[1701005,"Mapeo epicardico durante intervencion quirurgica",0,0]
[1701055,"Ecocardiagrama doppler color transesofagico",0,0]
[1701009,"Monitoreo continuo de presion arterial                                                                         ",0,0]
[1701013,"Cateterismo en recien nacido por arteria umbilical",0,0]
[1701014,"Instalacion de cateter swan-ganz o similar, en adultos o ninos",0,0]
[1701015,"Doppler con ergometria (por sesion)",0,0]
[1701016,"Doppler simple de vasos perifericos (por sesion)",0,0]
[1701017,"Pletismografia en reposo, esfuerzo c/u (por sesion)",0,0]
[1701018,"Registro ecoarterial o ecovenoso periferico c/u (por sesion)",0,0]
[1701025,"Cavografia (a.c. 04-02-035)",0,0]
[1701026,"Flebografia de cada extremidad (a.c.04-02-038)",0,0]
[1701027,"Flebografia yugular, suprarrenal, portografia transhepaticas, lumbar, espermatica o similar c/u (a.c. 04-02-041)",0,0]
[1701030,"Punción evacuadora de pericardio, c/s toma de muestra c/s inyección de medicamento",0,0]
[1701031,"Angioplastia intraluminal coronaria proc.cardiológico (a.c.04-02-022)",0,0]
[1701032,"Angioplastia intraluminal periférica proc.cardiológico (a.c.04-02-023)",0,0]
[1701034,"Cardioversion",0,0]
[1701036,"Desfibrilacion",0,0]
[1701037,"Puncion subclavia o yugular con colocacion de cateter",0,0]
[1701039,"Trombolisis arterial periferica",0,0]
[1701040,"Trombolisis intracoronaria",0,0]
[1701041,"Valvuloplastia mitral (a.c. 04-02-033)",0,0]
[1701042,"Valvuloplastia aortica y/o pulmonar,c/u (a.c. 04-02-033)",0,0]
[1701046,"Estudio electrofisiologico endocardiaco de las arritmias",0,0]
[1701050,"Ablacion con corriente continua o radiofrecuencia de nodulo",0,0]
[1701051,"Ablacion con corriente continua o con radiofrecuencia de vias accesorias y otros",{"$f":"SUM(D1614+G1614)","v":0},{"$f":"SUM(E1614:F1614)","v":0}]
[1707001,"Espirometría Basal                                                                                       ",0,0]
[1707002,"Espirometria basal y con broncodilatador                                                         ",0,0]
[1707003,"Provocacion con antigeno (incluye el antigeno)",0,0]
[1707004,"Test de provocacion con ejercicio                                                                      ",0,0]
[1707005,"Provocacion con histamina (pd 20),test de, (incluye la espirometría basal y el tratamiento de los efectos advesos de la histamina)",0,0]
[1707050,"Provocacion bronquial con histamina y/o metacolina",0,0]
[1707051,"Curva dosis respuesta a broncodilatadores.",0,0]
[1707006,"Test espirometrico de posicion lateral",0,0]
[1707007,"Analisis de gas espirado",0,0]
[1707008,"Capacidad de difusion, estudio de",0,0]
[1707009,"Capacidad fisica del trabajo",0,0]
[1707010,"Curva de lavado de nitrogeno (n)",0,0]
[1707011,"Curva de relajacion flujovolumen basal ",0,0]
[1707012,"Distensibilidad pulmonar, (\"compliance\"), estudio de",0,0]
[1707013,"Medicion de presion de oclusion",0,0]
[1707014,"Medicion de presion inspiratoria maxima (proc. Aut.)",0,0]
[1707015,"Medicion de presion trans-diafragmatica",0,0]
[1707016,"Registro flujometrico, por semana",0,0]
[1707017,"Respuesta respiratoria al co2",0,0]
[1707018,"Tiempo de tolerancia a la fatiga respiratoria",0,0]
[1707019,"Ventilacion alveolar, estudio de (incluye ventilacion minuto",0,0]
[1707020,"Volúmenes pulmonares por lavado de nitrógeno",0,0]
[1707021,"Laringotraqueobroncoscopia con fibroscopio",0,0]
[1707022,"Larigotraqueoscopia con tubo rigido",0,0]
[1707023,"Mediastinoscopia c/s biopsia",0,0]
[1707024,"Pleuroscopia (toracoscopia) c/s biopsia",0,0]
[1707025,"Procedimiento para determinar gasometria arterial en  reposo",0,0]
[1707026,"Procedimiento para determinar gasometria arterial respirando",0,0]
[1707054,"Saturacion de O2 en reposo y/o ejercicio (con oximetro)",0,0]
[1707055,"Saturacion de O2 en reposo y/o ejercicio y/o O2 100% (con  oximetro)",0,0]
[1707027,"Broncoaspiración, c/s lavado y/o colocación de medicamentos por sonda traqueobronquial (proc. aut.)",0,0]
[1707029,"Toracocentesis evacuadora,c/s toma de muestras",0,0]
[1707030,"Aerosolterapia con aire comprimido y oxigeno (en atencion cerrada, incluida en valor dia cama)    ",0,0]
[1707032,"Biopsia pleural (con aguja)",0,0]
[1707033,"Biopsia pulmonar (con aguja) no incluye la radiologia",0,0]
[1707034,"Cuerpo extrano de bronquio, extraccion por via",0,0]
[1707035,"Inmunoterapia por bcg",0,0]
[1707036,"Inmunoterapia por sesion (incluye el tratamiento de",0,0]
[1707037,"Intubacion traqueal (proc. Aut.)",0,0]
[1707038,"Monitoreo o estudio de apnea durante el sueño",0,0]
[1707052,"Monitorizacion saturacion de O2 durante el sueño",0,0]
[1707053,"Monitorizacion saturacion de O2 durante el sueño con presion positiva continua nasal",0,0]
[5099097,"Clorhidrometria",0,0]
[5099017,"TILT TEST ",0,0]
[5099098,"Ecocardiograma  estrés (con dobutamina)",0,0]
[null,"Instalación drenaje Pleural",0,0]
[null,"Pletismografia ",0,0]
[null,"Endosonografia Bronquial Obstructiva: EBUS",0,0]
[null,"Ablación septal con Alcohol en las Miocardiopatías Hipertróficas,",0,0]
[null,"Cierre comunicaciones intrauriculares con dispositivo, pediátrica",0,0]
[null,"Reposición por desplazamiento electrodo",0,0]
[null,"Extracción dispositivo implantable ",0,0]
[null,"Extraccion endovascular de electrodos de dispositivos implantados (marcapasos, desfibriladores o resincronizadores)",0,0]
[null,"Implantación Resincronizador (No Incluye Electrodos)",0,0]
[null,"Implante marcapasos desfibrilador DDD",0,0]
[null,"Implante marcapasos desfibrilador VVI",0,0]
[null,"Marcapaso DDD con desincronización cardiaca",0,0]
[null,"Marcapaso VVI con resincronisador cardiaco",0,0]
[null,"Recambio Desfibrilador Cardiaco Bicameral",0,0]
[null,"Reposicion electrodo Auricular ",0,0]
[null,"Reposiciones parciales equipo marcapaso ",0,0]
[null,"TEST de Ajmalina ",{"$f":"SUM(D1676+G1676)","v":0},{"$f":"SUM(E1676:F1676)","v":0}]
[null,"TEST de Procainamida ",0,0]
[null,"TEST Nitroglicerina ",0,0]
[null,"Ultrasonido intracardiaco: ICE",0,0]
[null,"Ultrasonido intravascular: IVUS",0,0]
[null,"Extracción de cuerpos extraños intravascular",0,0]
[null,"Cierre percutáneo del foramen oval con dispositivo Amplatzer: FOP",0,0]
[null,"Guía de presión intracoronaria: PW.",0,0]
[null,"Implantación percutánea de válvula aórtica: TAVI",0,0]
[null,"Estudio de Puentes Coronarios,",0,0]
[null,"Angioplastia con stent en ramas pulmonares",0,0]
[null,"Instalación de ECMO adulto",0,0]
[null,"Instalación de ECMO Pediátrico",0,0]
[null,"Cierre de ductos por coils ",0,0]
[null,"Tratamiento endovascular enfermedad arterial oclusiva de extremidades",0,0]
[null,"Instalación cateter central tunelizado ",0,0]
[null,"Tratamiento percutáneo de la coartación aortica",0,0]
[null,"Micro embolizaciones mal formación arterio venosa",0,0]
[null,"Inyectoterapia  de lesiones sangrantes",0,0]
[null,"TOTAL",{"$f":"SUM(C1588:C1694)","v":0},{"$f":"SUM(D1588:D1694)","v":0},0,0,0,null,null,null,null,null,null,null,null,null,null,null,null,null,null,null,null,null,null,null,0,0,0,0,0,0,0,0,0,0]
[null,"PROC. DIAGNOSTICO Y TERAPEUTICO                             "]
[1701001,"E.C.G. de reposo (incluye mínimo 12 derivaciones y 4 complejos por derivación)             ",{"$f":"SUM(D1697+G1697)","v":0},{"$f":"SUM(E1697:F1697)","v":0},null,null,null,null,null,null,null,null,null,null,null,null,null,null,null,null,null,null,null,null,null,null,null,null,null,null,null,null,null,null,null,null,5380,{"$f":"AK1697*E1697","v":0}]
[1701003,"Electrocardiograma de esfuerzo",{"$f":"SUM(D1698+G1698)","v":0},{"$f":"SUM(E1698:F1698)","v":0},null,null,null,null,null,null,null,null,null,null,null,null,null,null,null,null,null,null,null,null,null,null,null,null,null,null,null,null,null,null,null,null,15160,0]
[1701006,"E.C.G. continuo (test Holter o similares, por ej. variabilidad de la frecuencia cardíaca y/o alta resolución del ST y/o depolarización tardía); 20 a 24 horas de registro                                                             ",0,0,null,null,null,null,null,null,null,null,null,null,null,null,null,null,null,null,null,null,null,null,null,null,null,null,null,null,null,null,null,null,null,null,25710,0]
[1701007,"Ecocardiograma Doppler, con registro (incluye cód. 17.01.008)",0,0,null,null,null,null,null,null,null,null,null,null,null,null,null,null,null,null,null,null,null,null,null,null,null,null,null,null,null,null,null,null,null,null,49090,0]
[1701045,"Ecocardiograma bidimensional doppler color",0,0,null,null,null,null,null,null,null,null,null,null,null,null,null,null,null,null,null,null,null,null,null,null,null,null,null,null,null,null,null,null,null,null,54710,0]
[1701008,"Ecocardiograma bidimensional (incluye registro modo M, papel fotosensible y fotografía), en adultos o niños (proc. aut.)",0,0,null,null,null,null,null,null,null,null,null,null,null,null,null,null,null,null,null,null,null,null,null,null,null,null,null,null,null,null,null,null,null,null,30690,0]
[1701010,"Sondeo cardíaco derecho c/s termodilución, en adultos o niños",0,0,null,null,null,null,null,null,null,null,null,null,null,null,null,null,null,null,null,null,null,null,null,null,null,null,null,null,null,null,null,null,null,null,237460,0]
[1701011,"Sondeo cardíaco izquierdo y derecho, en adultos o niños",0,0,null,null,null,null,null,null,null,null,null,null,null,null,null,null,null,null,null,null,null,null,null,null,null,null,null,null,null,null,null,null,null,null,269940,0]
[1701012,"Sondeo cardíaco izquierdo, en adultos o niños",0,0,null,null,null,null,null,null,null,null,null,null,null,null,null,null,null,null,null,null,null,null,null,null,null,null,null,null,null,null,null,null,null,null,220130,0]
[1701019,"Cinecoronariografía derecha y/o izquierda (incluye sondeo cardíaco izquierdo  y ventriculografía izquierda)",0,0,null,null,null,null,null,null,null,null,null,null,null,null,null,null,null,null,null,null,null,null,null,null,null,null,null,null,null,null,null,null,null,null,282760,0]
[1701020,"Ventriculografía derecha, en adultos o niños (incl. proc. rad., y sondeo cardíaco derecho)",0,0,null,null,null,null,null,null,null,null,null,null,null,null,null,null,null,null,null,null,null,null,null,null,null,null,null,null,null,null,null,null,null,null,289320,0]
[1701021,"Ventriculografía izquierda, en adultos o niños (incl. proc. rad., y sondeo cardíaco izquierdo)",0,0,null,null,null,null,null,null,null,null,null,null,null,null,null,null,null,null,null,null,null,null,null,null,null,null,null,null,null,null,null,null,null,null,244680,0]
[1701022,"Aortografía, en adultos o niños (Incluye proc. rad.)",0,0,null,null,null,null,null,null,null,null,null,null,null,null,null,null,null,null,null,null,null,null,null,null,null,null,null,null,null,null,null,null,null,null,261160,0]
[1701023,"Arteriografía de extremidades, en adultos o niños (incluye proc. rad.)",0,0,null,null,null,null,null,null,null,null,null,null,null,null,null,null,null,null,null,null,null,null,null,null,null,null,null,null,null,null,null,null,null,null,312290,0]
[1701024,"Arteriografía selectiva o superselectiva (pulmonar, renal, tronco celíaco, etc) en adultos o niños (incl. proc. rad.)",0,0,null,null,null,null,null,null,null,null,null,null,null,null,null,null,null,null,null,null,null,null,null,null,null,null,null,null,null,null,null,null,null,null,276920,0]
[1701131,"Angioplastía Intraluminal coronaria uno o multiples vasos (incl. proc. rad; balón, rotablator, Stent o similar)",0,0,null,null,null,null,null,null,null,null,null,null,null,null,null,null,null,null,null,null,null,null,null,null,null,null,null,null,null,null,null,null,null,null,2026580,0]
[1701132,"Angioplastía Intraluminal periférica (incluye proc. rad., balón, Stent o similar)",0,0,null,null,null,null,null,null,null,null,null,null,null,null,null,null,null,null,null,null,null,null,null,null,null,null,null,null,null,null,null,null,null,null,1265800,0]
[1701043,"Angioplastía de coartación aórtica (incl. proc. rad.) (proc. completo)",0,0,null,null,null,null,null,null,null,null,null,null,null,null,null,null,null,null,null,null,null,null,null,null,null,null,null,null,null,null,null,null,null,null,1225140,0]
[1701144,"Angioplastía de arteria pulmonar o vena cava en niños (incluye proc. rad., balón, Stent o similar)",0,0,null,null,null,null,null,null,null,null,null,null,null,null,null,null,null,null,null,null,null,null,null,null,null,null,null,null,null,null,null,null,null,null,1283500,0]
[1701033,"Biopsia endomiocárdica (proc. completo)",0,0,null,null,null,null,null,null,null,null,null,null,null,null,null,null,null,null,null,null,null,null,null,null,null,null,null,null,null,null,null,null,null,null,181630,0]
[1701038,"Septostomía de Rashkind o con controlada con balón",0,0,null,null,null,null,null,null,null,null,null,null,null,null,null,null,null,null,null,null,null,null,null,null,null,null,null,null,null,null,null,null,null,null,414460,0]
[1701035,"Colocación de sonda marcapaso transitorio (proc. completo)",0,0,null,null,null,null,null,null,null,null,null,null,null,null,null,null,null,null,null,null,null,null,null,null,null,null,null,null,null,null,null,null,null,null,153660,0]
[1701141,"Valvuloplastía mitral o tricúspide (incl. proc. radiológico,  incluye balón)",0,0,null,null,null,null,null,null,null,null,null,null,null,null,null,null,null,null,null,null,null,null,null,null,null,null,null,null,null,null,null,null,null,null,1244950,0]
[1701142,"Valvuloplastía aórtica y/o pulmonar c/u (incl. proc. radiológico,  incluye balón)",0,0,null,null,null,null,null,null,null,null,null,null,null,null,null,null,null,null,null,null,null,null,null,null,null,null,null,null,null,null,null,null,null,null,1244950,0]
[null,"Total ARANCEL MAI",{"$f":"SUM(C1697:C1720)","v":0},{"$f":"SUM(D1697:D1720)","v":0},0,0,0,null,null,null,null,null,null,null,null,null,null,null,null,null,null,null,null,null,null,null,0,0,0,0,0,0,0,0,0,0,11616070,0]
[null,"Cierre percutáneo del foramen oval con dispositivo ",{"$f":"SUM(D1722+G1722)","v":0},{"$f":"SUM(E1722:F1722)","v":0},null,null,null,null,null,null,null,null,null,null,null,null,null,null,null,null,null,null,null,null,null,null,null,null,null,null,null,null,null,null,null,null,null,{"$f":"AK1722*E1722","v":0}]
[null,"TOTAL ARANCEL MLE Y NO ARANCELADO",{"$f":"C1722","v":0},{"$f":"D1722","v":0},0,0,0,null,null,null,null,null,null,null,null,null,null,null,null,null,null,null,null,null,null,null,0,0,0,0,0,0,0,0,0,0]
[null,"TOTAL PRODUCCION",{"$f":"SUM(C1721,C1723)","v":0},{"$f":"SUM(D1721,D1723)","v":0},0,0,0,null,null,null,null,null,null,null,null,null,null,null,null,null,null,null,null,null,null,null,0,0,0,0,0,0,0,0,0,0,11616070,0]
[null,"CIRUGIA CARDIOVASCULAR                                   "]
[1703001,"Embolectomía y/o trombectomía, unilateral, miembro superior o inferior (proc. aut.)",{"$f":"SUM(I1726:N1726)","v":0},null,null,null,null,{"$f":"+I1726+J1726","v":0},null,null,null,null,null,null,{"$f":"SUM(P1726:Q1726)","v":0},null,null,{"$f":"SUM(S1726:T1726)","v":0},null,null,{"$f":"SUM(V1726:W1726)","v":0},null,null,{"$f":"SUM(Y1726:Z1726)","v":0},null,null,null,null,null,null,null,null,null,null,null,null,182430,{"$f":"AK1726*I1726","v":0}]
[1703002,"Fístula arteriovenosa congénita o traumática, repar. quir.",{"$f":"SUM(I1727:N1727)","v":0},null,null,null,null,0,null,null,null,null,null,null,{"$f":"SUM(P1727:Q1727)","v":0},null,null,{"$f":"SUM(S1727:T1727)","v":0},null,null,{"$f":"SUM(V1727:W1727)","v":0},null,null,{"$f":"SUM(Y1727:Z1727)","v":0},null,null,null,null,null,null,null,null,null,null,null,null,261140,0]
[1703003,"Fístula arteriovenosa (de Brescia o similar)",{"$f":"SUM(I1728:N1728)","v":0},null,null,null,null,0,null,null,null,null,null,null,{"$f":"SUM(P1728:Q1728)","v":0},null,null,{"$f":"SUM(S1728:T1728)","v":0},null,null,{"$f":"SUM(V1728:W1728)","v":0},null,null,{"$f":"SUM(Y1728:Z1728)","v":0},null,null,null,null,null,null,null,null,null,null,null,null,159020,0]
[1703004,"Fístula arteriovenosa derivación externa",0,null,null,null,null,0,null,null,null,null,null,null,0,null,null,0,null,null,0,null,null,0,null,null,null,null,null,null,null,null,null,null,null,null,159020,0]
[1703005,"Reparación quirúrgica de vasos arteriales y/o venosos intra-abdominales o intra-torácicos c/s injerto (biológicos o sintéticos)",0,null,null,null,null,0,null,null,null,null,null,null,0,null,null,0,null,null,0,null,null,0,null,null,null,null,null,null,null,null,null,null,null,null,370370,0]
[1703006,"Reparación quirúrgica de vasos arteriales y/o venosos periféricos c/s injerto (biológicos o sintéticos)",0,null,null,null,null,0,null,null,null,null,null,null,0,null,null,0,null,null,0,null,null,0,null,null,null,null,null,null,null,null,null,null,null,null,242680,0]
[1703007,"Reparación quirúrgica de vasos arteriales y/o venosos periféricos c/s injerto (biológicos o sintéticos) aórtico-abdominal",0,null,null,null,null,0,null,null,null,null,null,null,0,null,null,0,null,null,0,null,null,0,null,null,null,null,null,null,null,null,null,null,null,null,581900,0]
[1703008,"Reparación quirúrgica de vasos arteriales y/o venosos periféricos c/s injerto (biológicos o sintéticos) periféricos",0,null,null,null,null,0,null,null,null,null,null,null,0,null,null,0,null,null,0,null,null,0,null,null,null,null,null,null,null,null,null,null,null,null,276760,0]
[1703009,"Reparación quirúrgica de vasos arteriales y/o venosos periféricos c/s injerto (biológicos o sintéticos) tóraco-abdominal",0,null,null,null,null,0,null,null,null,null,null,null,0,null,null,0,null,null,0,null,null,0,null,null,null,null,null,null,null,null,null,null,null,null,747460,0]
[1703010,"Puentes aorto bifemoral puentes de troncos supra-aórticos",0,null,null,null,null,0,null,null,null,null,null,null,0,null,null,0,null,null,0,null,null,0,null,null,null,null,null,null,null,null,null,null,null,null,505490,0]
[1703011,"Puentes aorto aorto unifemoral",0,null,null,null,null,0,null,null,null,null,null,null,0,null,null,0,null,null,0,null,null,0,null,null,null,null,null,null,null,null,null,null,null,null,411940,0]
[1703012,"Puente aorto-visceral (renal, mesentérico o similar); c/u",0,null,null,null,null,0,null,null,null,null,null,null,0,null,null,0,null,null,0,null,null,0,null,null,null,null,null,null,null,null,null,null,null,null,488320,0]
[1703013,"Puentes aorto aorto ilíaco",0,null,null,null,null,0,null,null,null,null,null,null,0,null,null,0,null,null,0,null,null,0,null,null,null,null,null,null,null,null,null,null,null,null,488320,0]
[1703014,"Endarterectomía carotídea, subclavia, vertebral, femoral, o similar  c/s injerto (proc. aut.)",0,null,null,null,null,0,null,null,null,null,null,null,0,null,null,0,null,null,0,null,null,0,null,null,null,null,null,null,null,null,null,null,null,null,411940,0]
[1703015,"Endarterectomía femoral común, superficial o profunda, poplítea u otras c/s injerto (proc. aut.)",0,null,null,null,null,0,null,null,null,null,null,null,0,null,null,0,null,null,0,null,null,0,null,null,null,null,null,null,null,null,null,null,null,null,292410,0]
[1703016,"Endarterectomía renal, c/s injerto (proc. aut.)",0,null,null,null,null,0,null,null,null,null,null,null,0,null,null,0,null,null,0,null,null,0,null,null,null,null,null,null,null,null,null,null,null,null,355950,0]
[1703017,"Endarterectomía fémoro-tibial o distales",0,null,null,null,null,0,null,null,null,null,null,null,0,null,null,0,null,null,0,null,null,0,null,null,null,null,null,null,null,null,null,null,null,null,411940,0]
[1703018,"Endarterectomía fémoro-poplíteo",0,null,null,null,null,0,null,null,null,null,null,null,0,null,null,0,null,null,0,null,null,0,null,null,null,null,null,null,null,null,null,null,null,null,411940,0]
[1703019,"Ligadura troncos arteriales, (proc. aut.)",0,null,null,null,null,0,null,null,null,null,null,null,0,null,null,0,null,null,0,null,null,0,null,null,null,null,null,null,null,null,null,null,null,null,191770,0]
[1703020,"Otras derivaciones: fémoro–femoral, axilo-humeral, axilo-femoral, carótidosubclavio, axilo-axilar o similares; c/u",0,null,null,null,null,0,null,null,null,null,null,null,0,null,null,0,null,null,0,null,null,0,null,null,null,null,null,null,null,null,null,null,null,null,370360,0]
[1703021,"Anastomosis portocava u otras portosistémicas",0,null,null,null,null,0,null,null,null,null,null,null,0,null,null,0,null,null,0,null,null,0,null,null,null,null,null,null,null,null,null,null,null,null,535120,0]
[1703022,"Anastomosis venosas intraabdominales",0,null,null,null,null,0,null,null,null,null,null,null,0,null,null,0,null,null,0,null,null,0,null,null,null,null,null,null,null,null,null,null,null,null,462310,0]
[1703023,"Denudación venosa (proc. aut.)",0,null,null,null,null,0,null,null,null,null,null,null,null,null,null,null,null,null,null,null,null,null,null,null,null,null,null,null,null,null,null,null,null,null,36380,0]
[1703024,"Derivaciones venosas de extremidades puentes venosos",0,null,null,null,null,0,null,null,null,null,null,null,0,null,null,0,null,null,0,null,null,0,null,null,null,null,null,null,null,null,null,null,null,null,300510,0]
[1703025,"Implante filtros venosos",0,null,null,null,null,0,null,null,null,null,null,null,0,null,null,0,null,null,0,null,null,0,null,null,null,null,null,null,null,null,null,null,null,null,294630,0]
[1703026,"Ligadura cayado safena interna, unilateral",0,null,null,null,null,0,null,null,null,null,null,null,0,null,null,0,null,null,0,null,null,0,null,null,null,null,null,null,null,null,null,null,null,null,137580,0]
[1703027,"Ligadura otros troncos venosos (poplíteo, femoral, ilíacas, humeral, axilar, otros); ligadura de venas comunicantes y/o perforantes, y/o resección de paquetes varicosos, cualquier técnica (una extremidad);c/u",0,null,null,null,null,0,null,null,null,null,null,null,0,null,null,0,null,null,0,null,null,0,null,null,null,null,null,null,null,null,null,null,null,null,152430,0]
[1703028,"Ligadura vena cava inferior",0,null,null,null,null,0,null,null,null,null,null,null,0,null,null,0,null,null,0,null,null,0,null,null,null,null,null,null,null,null,null,null,null,null,280120,0]
[1703029,"Resección cutáneo-aponeurótica unilateral (incluye fasciotomía interna o posterior)",0,null,null,null,null,0,null,null,null,null,null,null,0,null,null,0,null,null,0,null,null,0,null,null,null,null,null,null,null,null,null,null,null,null,170730,0]
[1703030,"Safenectomía interna y/o externa, unilateral, o endoablación por cualquier técnica (láser, radiofrecuencia o similar).",0,null,null,null,null,0,null,null,null,null,null,null,0,null,null,0,null,null,0,null,null,0,null,null,null,null,null,null,null,null,null,null,null,null,146540,0]
[1703031,"Trombectomía de venas profundas",0,null,null,null,null,0,null,null,null,null,null,null,0,null,null,0,null,null,0,null,null,0,null,null,null,null,null,null,null,null,null,null,null,null,152020,0]
[1703032,"Anastomosis linfovenosas",0,null,null,null,null,0,null,null,null,null,null,null,0,null,null,0,null,null,0,null,null,0,null,null,null,null,null,null,null,null,null,null,null,null,219630,0]
[1703033,"Linfedema, trat. quir. una extremidad",0,null,null,null,null,0,null,null,null,null,null,null,0,null,null,0,null,null,0,null,null,0,null,null,null,null,null,null,null,null,null,null,null,null,281970,{"$f":"AK1758*I1758","v":0}]
[1703034,"Adenitis, trat. quir.",0,null,null,null,null,0,null,null,null,null,null,null,null,null,null,null,null,null,null,null,null,null,null,null,null,null,null,null,null,null,null,null,null,null,44240,0]
[1703035,"Biopsia quir. ganglionar (cualquier región periférica superficial o profunda) (proc. aut.)",0,null,null,null,null,0,null,null,null,null,null,null,null,null,null,null,null,null,null,null,null,null,null,null,null,null,null,null,null,null,null,null,null,null,85790,0]
[1703036,"Disección y extirpación  ganglionar regional (proc. aut.): axilo-supraclavicular",0,null,null,null,null,0,null,null,null,null,null,null,0,null,null,0,null,null,0,null,null,0,null,null,null,null,null,null,null,null,null,null,null,null,352480,0]
[1703037,"Disección y extirpación  ganglionar regional (proc. aut.): cérvico-torácica",0,null,null,null,null,0,null,null,null,null,null,null,0,null,null,0,null,null,0,null,null,0,null,null,null,null,null,null,null,null,null,null,null,null,316080,0]
[1703038,"Disección y extirpación  ganglionar regional (proc. aut.): ileoinguinal",0,null,null,null,null,0,null,null,null,null,null,null,0,null,null,0,null,null,0,null,null,0,null,null,null,null,null,null,null,null,null,null,null,null,355070,0]
[1703039,"Disección y extirpación  ganglionar regional (proc. aut.): inguinoescrotales",0,null,null,null,null,0,null,null,null,null,null,null,0,null,null,0,null,null,0,null,null,0,null,null,null,null,null,null,null,null,null,null,null,null,300510,0]
[1703040,"Disección y extirpación  ganglionar regional (proc. aut.): lumbo-aórticos",0,null,null,null,null,0,null,null,null,null,null,null,0,null,null,0,null,null,0,null,null,0,null,null,null,null,null,null,null,null,null,null,null,null,437440,0]
[1703041,"Disección y extirpación  ganglionar regional (proc. aut.): mediastínicos",0,null,null,null,null,0,null,null,null,null,null,null,0,null,null,0,null,null,0,null,null,0,null,null,null,null,null,null,null,null,null,null,null,null,411940,0]
[1703042,"Disección y extirpación  ganglionar regional (proc. aut.): poplíteos",0,null,null,null,null,0,null,null,null,null,null,null,0,null,null,0,null,null,0,null,null,0,null,null,null,null,null,null,null,null,null,null,null,null,197700,0]
[1703043,"Vaciamiento (disección) radical cuello (v.r.c.) clásico ipsilateral",0,null,null,null,null,0,null,null,null,null,null,null,0,null,null,0,null,null,0,null,null,0,null,null,null,null,null,null,null,null,null,null,null,null,294630,0]
[1703044,"Disección y extirpación  ganglionar regional (proc. aut.): yugular simple",0,null,null,null,null,0,null,null,null,null,null,null,0,null,null,0,null,null,0,null,null,0,null,null,null,null,null,null,null,null,null,null,null,null,137580,0]
[1703045,"Simpatectomía cérvico-torácica",0,null,null,null,null,0,null,null,null,null,null,null,0,null,null,0,null,null,0,null,null,0,null,null,null,null,null,null,null,null,null,null,null,null,316080,0]
[1703046,"Simpatectomía lumbar",0,null,null,null,null,0,null,null,null,null,null,null,0,null,null,0,null,null,0,null,null,0,null,null,null,null,null,null,null,null,null,null,null,null,274540,0]
[1703047,"Anastomosis vasculares sistémicopulmonares (Blalock-Pott-Glenn o similares)",0,null,null,null,null,0,null,null,null,null,null,null,0,null,null,0,null,null,0,null,null,0,null,null,null,null,null,null,null,null,null,null,null,null,535120,0]
[1703048,"Cambio de generador de marcapaso, sin cambio de electrodo (no incluye el valor de la prótesis)",0,null,null,null,null,0,null,null,null,null,null,null,0,null,null,0,null,null,0,null,null,0,null,null,null,null,null,null,null,null,null,null,null,null,143100,0]
[1703148,"Cambio de generador de marcapaso (incluye el valor de la prótesis)",0,null,null,null,null,0,null,null,null,null,null,null,0,null,null,0,null,null,0,null,null,0,null,null,null,null,null,null,null,null,null,null,null,null,1604060,0]
[1703049,"Coartación aórtica infantil (preductal) trat. quir.",0,null,null,null,null,0,null,null,null,null,null,null,0,null,null,0,null,null,0,null,null,0,null,null,null,null,null,null,null,null,null,null,null,null,535120,0]
[1703050,"Coartación aórtica, trat. quir.",0,null,null,null,null,0,null,null,null,null,null,null,0,null,null,0,null,null,0,null,null,0,null,null,null,null,null,null,null,null,null,null,null,null,535120,0]
[1703051,"Conducto arterioso persistente, trat. quir.",0,null,null,null,null,0,null,null,null,null,null,null,0,null,null,0,null,null,0,null,null,0,null,null,null,null,null,null,null,null,null,null,null,null,598200,0]
[1703052,"Fístula coronaria, trat. quir.",0,null,null,null,null,0,null,null,null,null,null,null,0,null,null,0,null,null,0,null,null,0,null,null,null,null,null,null,null,null,null,null,null,null,475500,0]
[1703053,"Implantación de marcapaso c/electrod. intraven. o epicárdico (no incluye el valor de la prótesis)",0,null,null,null,null,0,null,null,null,null,null,null,0,null,null,0,null,null,0,null,null,0,null,null,null,null,null,null,null,null,null,null,null,null,193320,0]
[1703153,"Implantación de marcapaso c/electrod. intraven. o epicárdico (incluye el valor de la prótesis)",0,null,null,null,null,0,null,null,null,null,null,null,0,null,null,0,null,null,0,null,null,0,null,null,null,null,null,null,null,null,null,null,null,null,1937020,0]
[1703054,"Operación sobre anillos valvulares o vasculares",0,null,null,null,null,0,null,null,null,null,null,null,0,null,null,0,null,null,0,null,null,0,null,null,null,null,null,null,null,null,null,null,null,null,392380,0]
[1703055,"Operaciones sobre arteria pulmonar, constricción por cinta",0,null,null,null,null,0,null,null,null,null,null,null,0,null,null,0,null,null,0,null,null,0,null,null,null,null,null,null,null,null,null,null,null,null,370370,0]
[1703056,"Pericardiectomía y/o extirp. de quistes y/o tumores",0,null,null,null,null,0,null,null,null,null,null,null,0,null,null,0,null,null,0,null,null,0,null,null,null,null,null,null,null,null,null,null,null,null,489870,0]
[1703057,"Pericardiorrafia o míopericardiorrafia en heridas penetrante",{"$f":"SUM(I1784:N1784)","v":0},null,null,null,null,0,null,null,null,null,null,null,0,null,null,0,null,null,0,null,null,0,null,null,null,null,null,null,null,null,null,null,null,null,453470,0]
[1703058,"Pericardiotomía",0,null,null,null,null,0,null,null,null,null,null,null,0,null,null,0,null,null,0,null,null,0,null,null,null,null,null,null,null,null,null,null,null,null,292410,0]
[1703059,"Sinequias pericárdicas, trat. quir. ( proc. aut.)",0,null,null,null,null,0,null,null,null,null,null,null,0,null,null,0,null,null,0,null,null,0,null,null,null,null,null,null,null,null,null,null,null,null,453470,0]
[1703060,"Operaciones cardíacas sin circulación extracorpórea",0,null,null,null,null,0,null,null,null,null,null,null,0,null,null,0,null,null,0,null,null,0,null,null,null,null,null,null,null,null,null,null,null,null,492340,0]
[1703061,"De complejidad mayor: incluye reempl. valv. múl., tres o más ptes aortoc. y/o anast. con art. mamaria, correc. card. cong. compl. (por ej.: Fallot; atresia tric.; doble salida del vent. der.; transp. grandes vasos; vent. único o sim.), ...",0,null,null,null,null,0,null,null,null,null,null,null,0,null,null,0,null,null,0,null,null,0,null,null,null,null,null,null,null,null,null,null,null,null,3653080,0]
[1703062,"De complejidad mediana: incluye comunicación interventricular, reemplazo univalvular, uno o dos puentes aortocoronarios; aneurisma ventricular, corrección de Wolf-Parkinson White y otras arritmias",0,null,null,null,null,0,null,null,null,null,null,null,0,null,null,0,null,null,0,null,null,0,null,null,null,null,null,null,null,null,null,null,null,null,2211830,0]
[1703063,"De complejidad menor: incluye comunicación interauricular simple, estenosis pulmonar valvular, estenosis mitral o similar",0,null,null,null,null,{"$f":"+I1790+J1790","v":0},null,null,null,null,null,null,0,null,null,0,null,null,0,null,null,0,null,null,null,null,null,null,null,null,null,null,null,null,1360160,{"$f":"AK1790*I1790","v":0}]
[null,"TOTAL ARANCEL MAI",{"$f":"SUM(C1726:C1790)","v":0},null,null,null,null,{"$f":"SUM(H1726:H1790)","v":0},0,0,0,0,0,0,0,0,0,0,0,0,0,0,0,0,0,0,0,0,0,0,0,0,0,0,0,0,30741150,0]
[null,"Instalación de ECMO adulto (cirugía)",{"$f":"SUM(I1792:N1792)","v":0},null,null,null,null,{"$f":"+I1792+J1792","v":0},null,null,null,null,null,null,0,null,null,{"$f":"SUM(S1792:T1792)","v":0},null,null,{"$f":"SUM(V1792:W1792)","v":0},null,null,{"$f":"SUM(Y1792:Z1792)","v":0}]
[null,"Instalación de ECMO Pediátrico (cirugía)",{"$f":"SUM(I1793:N1793)","v":0},null,null,null,null,0,null,null,null,null,null,null,0,null,null,0,null,null,0,null,null,0]
[null,"Trasplante corazón",0,null,null,null,null,0,null,null,null,null,null,null,{"$f":"SUM(P1794:Q1794)","v":0},null,null,0,null,null,0,null,null,0]
[null,"Implantación Resincronizador (No Incluye Electrodos)",{"$f":"SUM(I1795:N1795)","v":0},null,null,null,null,0,null,null,null,null,null,null,0,null,null,0,null,null,0,null,null,0]
[null,"Implante marcapasos desfibrilador DDD",{"$f":"SUM(I1796:N1796)","v":0},null,null,null,null,0,null,null,null,null,null,null,0,null,null,0,null,null,0,null,null,0]
[null,"Implante marcapasos desfibrilador VVI",0,null,null,null,null,0,null,null,null,null,null,null,0,null,null,0,null,null,0,null,null,0]
[null,"Implante marcapaso DDD con resincronización cardiaca",0,null,null,null,null,0,null,null,null,null,null,null,0,null,null,0,null,null,0,null,null,0]
[null,"Implante marcapaso VVI con resincronisador cardiaco",0,null,null,null,null,0,null,null,null,null,null,null,0,null,null,0,null,null,0,null,null,0]
[null,"Recambio Desfibrilador Cardiaco Bicameral",0,null,null,null,null,0,null,null,null,null,null,null,0,null,null,0,null,null,0,null,null,0]
[null,"Reposicion electrodo Auricular ",0,null,null,null,null,0,null,null,null,null,null,null,0,null,null,0,null,null,0,null,null,0]
[null,"Reposiciones parciales equipo marcapaso ",0,null,null,null,null,0,null,null,null,null,null,null,0,null,null,0,null,null,0,null,null,0]
[null," TOTAL ARANCEL MLE Y NO ARANCELADO ",{"$f":"SUM(C1792:C1802)","v":0},null,null,null,null,{"$f":"SUM(H1792:H1802)","v":0},0,0,0,0,0,0,0,0,0,0,0,0,0,0,0,0,0,0,0,0,0,0,0,0,0,0,0,0]
[null," TOTAL PRODUCCION ",{"$f":"SUM(C1791+C1803)","v":0},null,null,null,null,{"$f":"SUM(H1791+H1803)","v":0},0,0,0,0,0,0,0,0,0,0,0,0,0,0,0,0,0,0,0,0,0,0,0,0,0,0,0,0,30741150,0]
[null,"CIRUGIA DE TORAX     "]
[1704001,"Cirugía del opérculo torácico (resección de primera costilla, cualquier abordaje); unilateral",{"$f":"SUM(I1806:N1806)","v":0},null,null,null,null,{"$f":"+I1806+J1806","v":0},null,null,null,null,null,null,{"$f":"SUM(P1806:Q1806)","v":0},null,null,{"$f":"SUM(S1806:T1806)","v":0},null,null,{"$f":"SUM(V1806:W1806)","v":0},null,null,{"$f":"SUM(Y1806:Z1806)","v":0},null,null,null,null,null,null,null,null,null,null,null,null,282490,{"$f":"AK1806*I1806","v":0}]
[1704002,"Cirugía tórax abierto traumático y/o fijación tórax volante, osteosíntesis costales múltiples y de esternón (no incluye el valor de la prótesis)",{"$f":"SUM(I1807:N1807)","v":0},null,null,null,null,0,null,null,null,null,null,null,{"$f":"SUM(P1807:Q1807)","v":0},null,null,{"$f":"SUM(S1807:T1807)","v":0},null,null,{"$f":"SUM(V1807:W1807)","v":0},null,null,{"$f":"SUM(Y1807:Z1807)","v":0},null,null,null,null,null,null,null,null,null,null,null,null,379680,0]
[1704003,"Fenestración o toracoplastía",{"$f":"SUM(I1808:N1808)","v":0},null,null,null,null,0,null,null,null,null,null,null,{"$f":"SUM(P1808:Q1808)","v":0},null,null,{"$f":"SUM(S1808:T1808)","v":0},null,null,{"$f":"SUM(V1808:W1808)","v":0},null,null,{"$f":"SUM(Y1808:Z1808)","v":0},null,null,null,null,null,null,null,null,null,null,null,null,274540,0]
[1704004,"Reparación pectum excavatum o carinatum, (proc. aut.)",0,null,null,null,null,0,null,null,null,null,null,null,0,null,null,0,null,null,0,null,null,0,null,null,null,null,null,null,null,null,null,null,null,null,249540,0]
[1704005,"Resección de costillas y/o pared costal y/o cartílago y/o esternón s/plastía (proc. aut.)",0,null,null,null,null,0,null,null,null,null,null,null,0,null,null,0,null,null,0,null,null,0,null,null,null,null,null,null,null,null,null,null,null,null,190740,0]
[1704006,"Resección de pared costal c/plastía (toracoplastía osteoplástica de York o similar)",0,null,null,null,null,0,null,null,null,null,null,null,0,null,null,0,null,null,0,null,null,0,null,null,null,null,null,null,null,null,null,null,null,null,232280,0]
[1704007,"Toracofrenolaparatomía exploradora c/s reparación vísceras torácicas y abdominales",0,null,null,null,null,0,null,null,null,null,null,null,0,null,null,0,null,null,0,null,null,0,null,null,null,null,null,null,null,null,null,null,null,null,339180,0]
[1704008,"Toracofrenotomía exploradora",0,null,null,null,null,0,null,null,null,null,null,null,0,null,null,0,null,null,0,null,null,0,null,null,null,null,null,null,null,null,null,null,null,null,292410,0]
[1704009,"Toracotomía exploradora, c/s biopsia, c/s debridación, c/s drenaje",0,null,null,null,null,0,null,null,null,null,null,null,0,null,null,0,null,null,0,null,null,0,null,null,null,null,null,null,null,null,null,null,null,null,243350,0]
[1704010,"Toracotomía mínima c/s resección costal, c/s biopsia, c/s drenaje",0,null,null,null,null,0,null,null,null,null,null,null,0,null,null,0,null,null,0,null,null,0,null,null,null,null,null,null,null,null,null,null,null,null,123950,0]
[1704011,"Mediastinotomía exploradora ant. o post. c/s biopsia proc. aut",0,null,null,null,null,0,null,null,null,null,null,null,0,null,null,0,null,null,0,null,null,0,null,null,null,null,null,null,null,null,null,null,null,null,185500,0]
[1704012,"Mediastinotomía exploradora ant. o post. c/s biopsia proc. Aut vía cervical",0,null,null,null,null,0,null,null,null,null,null,null,0,null,null,0,null,null,0,null,null,0,null,null,null,null,null,null,null,null,null,null,null,null,159020,0]
[1704013,"Mediastinotomía exploradora ant. o post. c/s biopsia proc. Aut vía torácica",0,null,null,null,null,0,null,null,null,null,null,null,0,null,null,0,null,null,0,null,null,0,null,null,null,null,null,null,null,null,null,null,null,null,226030,0]
[1704014,"Timectomía vía cervical",0,null,null,null,null,0,null,null,null,null,null,null,0,null,null,0,null,null,0,null,null,0,null,null,null,null,null,null,null,null,null,null,null,null,210240,0]
[1704015,"Timectomía vía torácica medioesternal",0,null,null,null,null,0,null,null,null,null,null,null,0,null,null,0,null,null,0,null,null,0,null,null,null,null,null,null,null,null,null,null,null,null,263500,0]
[1704016,"Conducto torácico, ligadura quirúrgica",0,null,null,null,null,0,null,null,null,null,null,null,0,null,null,0,null,null,0,null,null,0,null,null,null,null,null,null,null,null,null,null,null,null,274530,0]
[1704017,"Tumores o quistes de mediastino (anterior o posterior) trat. quir. c/s disección ganglionar",0,null,null,null,null,0,null,null,null,null,null,null,0,null,null,0,null,null,0,null,null,0,null,null,null,null,null,null,null,null,null,null,null,null,417090,0]
[1704018,"Cirugía del diafragma con cirugía de vísceras abdominales o torácicas",0,null,null,null,null,0,null,null,null,null,null,null,0,null,null,0,null,null,0,null,null,0,null,null,null,null,null,null,null,null,null,null,null,null,344380,0]
[1704064,"Frenoparálisis trat. quir.",0,null,null,null,null,0,null,null,null,null,null,null,0,null,null,0,null,null,0,null,null,0,null,null,null,null,null,null,null,null,null,null,null,null,342620,0]
[1704019,"Heridas traumáticas, trat. quir.",0,null,null,null,null,0,null,null,null,null,null,null,0,null,null,0,null,null,0,null,null,0,null,null,null,null,null,null,null,null,null,null,null,null,253720,0]
[1704020,"Hernioplastía diafragmática por vía torácica c/ prótesis (no incluye valor de la prótesis)",0,null,null,null,null,0,null,null,null,null,null,null,0,null,null,0,null,null,0,null,null,0,null,null,null,null,null,null,null,null,null,null,null,null,292410,0]
[1704021,"Hernioplastía diafragmática por vía torácica, sin prótesis",0,null,null,null,null,0,null,null,null,null,null,null,0,null,null,0,null,null,0,null,null,0,null,null,null,null,null,null,null,null,null,null,null,null,264140,0]
[1704022,"Tumores, malformaciones o quistes del diafragma (no incluye valor de la prótesis) trat. quir.",0,null,null,null,null,0,null,null,null,null,null,null,0,null,null,0,null,null,0,null,null,0,null,null,null,null,null,null,null,null,null,null,null,null,292410,0]
[1704023,"Cuerpo extraño pleural, extrac. quir.",0,null,null,null,null,0,null,null,null,null,null,null,0,null,null,0,null,null,0,null,null,0,null,null,null,null,null,null,null,null,null,null,null,null,243350,0]
[1704024,"Decorticación pleuropulmonar (pleurectomía parcial o total)",0,null,null,null,null,0,null,null,null,null,null,null,0,null,null,0,null,null,0,null,null,0,null,null,null,null,null,null,null,null,null,null,null,null,288410,0]
[1704025,"Pleurodesis por pleurotomía",0,null,null,null,null,0,null,null,null,null,null,null,0,null,null,0,null,null,0,null,null,0,null,null,null,null,null,null,null,null,null,null,null,null,82340,0]
[1704026,"Pleurodesis por toracotomía",0,null,null,null,null,0,null,null,null,null,null,null,0,null,null,0,null,null,0,null,null,0,null,null,null,null,null,null,null,null,null,null,null,null,261210,0]
[1704027,"Pleurotomía única o doble c/s biopsia con trócar",0,null,null,null,null,0,null,null,null,null,null,null,null,null,null,null,null,null,null,null,null,null,null,null,null,null,null,null,null,null,null,null,null,null,57940,0]
[1704028,"Tumores pleurales, trat. quir.",0,null,null,null,null,0,null,null,null,null,null,null,0,null,null,0,null,null,0,null,null,0,null,null,null,null,null,null,null,null,null,null,null,null,266420,0]
[1704029,"Broncotomía o traqueobroncotomía exploradora o terapéutica por toracotomía (proc. aut.)",0,null,null,null,null,0,null,null,null,null,null,null,0,null,null,0,null,null,0,null,null,0,null,null,null,null,null,null,null,null,null,null,null,null,292410,0]
[1704030,"Cirugía ruptura traqueobronquial o tratamiento quirúrgico fístula bronquial por esternotomía media",0,null,null,null,null,0,null,null,null,null,null,null,0,null,null,0,null,null,0,null,null,0,null,null,null,null,null,null,null,null,null,null,null,null,475500,0]
[1704031,"Plastía de tráquea y/o bronquios c/s resección, c/s prótesis (no incluye el valor de la prótesis)",0,null,null,null,null,0,null,null,null,null,null,null,0,null,null,0,null,null,0,null,null,0,null,null,null,null,null,null,null,null,null,null,null,null,484670,0]
[1704032,"Tratamiento quirúrgico fístula bronquial por toracotomía",0,null,null,null,null,0,null,null,null,null,null,null,0,null,null,0,null,null,0,null,null,0,null,null,null,null,null,null,null,null,null,null,null,null,381950,{"$f":"AK1838*I1838","v":0}]
[1704033,"Tumores traqueales, extirpación",0,null,null,null,null,0,null,null,null,null,null,null,0,null,null,0,null,null,0,null,null,0,null,null,null,null,null,null,null,null,null,null,null,null,466820,0]
[1704034,"Absceso pulmonar, drenaje por toracotomía",0,null,null,null,null,0,null,null,null,null,null,null,0,null,null,0,null,null,0,null,null,0,null,null,null,null,null,null,null,null,null,null,null,null,261210,0]
[1704035,"Biopsia pulmonar por toracotomía",0,null,null,null,null,0,null,null,null,null,null,null,0,null,null,0,null,null,0,null,null,0,null,null,null,null,null,null,null,null,null,null,null,null,243350,0]
[1704036,"Bulas, trat. quir.",0,null,null,null,null,0,null,null,null,null,null,null,0,null,null,0,null,null,0,null,null,0,null,null,null,null,null,null,null,null,null,null,null,null,243350,0]
[1704037,"Cirugía de quiste hidatídico sin resección pulmonar",0,null,null,null,null,0,null,null,null,null,null,null,0,null,null,0,null,null,0,null,null,0,null,null,null,null,null,null,null,null,null,null,null,null,433910,0]
[1704038,"Cuerpo extraño intrapulmonar, extirp. quir.",0,null,null,null,null,0,null,null,null,null,null,null,0,null,null,0,null,null,0,null,null,0,null,null,null,null,null,null,null,null,null,null,null,null,269290,0]
[1704039,"Heridas de pulmón, trat. quir. (proc. aut.)",0,null,null,null,null,0,null,null,null,null,null,null,0,null,null,0,null,null,0,null,null,0,null,null,null,null,null,null,null,null,null,null,null,null,227100,0]
[1704040,"Lobectomía o bilobectomía",0,null,null,null,null,0,null,null,null,null,null,null,0,null,null,0,null,null,0,null,null,0,null,null,null,null,null,null,null,null,null,null,null,null,433910,0]
[1704041,"Metástasis bilateral, trat. quir. por esternotomía",0,null,null,null,null,0,null,null,null,null,null,null,0,null,null,0,null,null,0,null,null,0,null,null,null,null,null,null,null,null,null,null,null,null,433910,0]
[1704042,"Metástasis unilateral",0,null,null,null,null,0,null,null,null,null,null,null,0,null,null,0,null,null,0,null,null,0,null,null,null,null,null,null,null,null,null,null,null,null,307970,0]
[1704043,"Neumonectomía c/s resección de pared costal",0,null,null,null,null,0,null,null,null,null,null,null,0,null,null,0,null,null,0,null,null,0,null,null,null,null,null,null,null,null,null,null,null,null,506670,0]
[1704044,"Neumostomía (proc. aut.)",0,null,null,null,null,0,null,null,null,null,null,null,0,null,null,0,null,null,0,null,null,0,null,null,null,null,null,null,null,null,null,null,null,null,243350,0]
[1704045,"Quistectomía simple",0,null,null,null,null,0,null,null,null,null,null,null,0,null,null,0,null,null,0,null,null,0,null,null,null,null,null,null,null,null,null,null,null,null,307970,0]
[1704046,"Resecciones segmentarias",0,null,null,null,null,0,null,null,null,null,null,null,0,null,null,0,null,null,0,null,null,0,null,null,null,null,null,null,null,null,null,null,null,null,370370,0]
[1704047,"Resecciones segmentarias vía cervical",0,null,null,null,null,0,null,null,null,null,null,null,0,null,null,0,null,null,0,null,null,0,null,null,null,null,null,null,null,null,null,null,null,null,155110,0]
[1704048,"Resecciones segmentarias vía torácica",0,null,null,null,null,0,null,null,null,null,null,null,0,null,null,0,null,null,0,null,null,0,null,null,null,null,null,null,null,null,null,null,null,null,274530,0]
[1704049,"Esofagostomía cervical (proc. aut.)",0,null,null,null,null,0,null,null,null,null,null,null,0,null,null,0,null,null,0,null,null,0,null,null,null,null,null,null,null,null,null,null,null,null,155110,0]
[1704050,"Tumores benignos y/o quistes. trat. quir.- Vía cervical",0,null,null,null,null,0,null,null,null,null,null,null,0,null,null,0,null,null,0,null,null,0,null,null,null,null,null,null,null,null,null,null,null,null,203880,0]
[1704051,"Tumores benignos y/o quistes. trat. quir.- Vía torácica",0,null,null,null,null,0,null,null,null,null,null,null,0,null,null,0,null,null,0,null,null,0,null,null,null,null,null,null,null,null,null,null,null,null,274530,0]
[1704052,"Divertículos, trat. quir.- Vía cervical",0,null,null,null,null,0,null,null,null,null,null,null,0,null,null,0,null,null,0,null,null,0,null,null,null,null,null,null,null,null,null,null,null,null,182430,0]
[1704053,"Divertículos, trat. quir.- Vía torácica",0,null,null,null,null,0,null,null,null,null,null,null,0,null,null,0,null,null,0,null,null,0,null,null,null,null,null,null,null,null,null,null,null,null,253120,0]
[1704054,"Achalasia, trat. quir.",0,null,null,null,null,0,null,null,null,null,null,null,0,null,null,0,null,null,0,null,null,0,null,null,null,null,null,null,null,null,null,null,null,null,294630,0]
[1704055,"Atresia esofágica, trat. quir.",0,null,null,null,null,0,null,null,null,null,null,null,0,null,null,0,null,null,0,null,null,0,null,null,null,null,null,null,null,null,null,null,null,null,467560,0]
[1704056,"Esofagectomía con restitución del tránsito mediante estómago o intestino; parcial o total",0,null,null,null,null,0,null,null,null,null,null,null,0,null,null,0,null,null,0,null,null,0,null,null,null,null,null,null,null,null,null,null,null,null,566310,0]
[1704057,"Esofagectomía total con esofagostomía, gastrostomía y yeyunostomía",0,null,null,null,null,0,null,null,null,null,null,null,0,null,null,0,null,null,0,null,null,0,null,null,null,null,null,null,null,null,null,null,null,null,472740,0]
[1704058,"Esofagogastrectomía proximal",0,null,null,null,null,0,null,null,null,null,null,null,0,null,null,0,null,null,0,null,null,0,null,null,null,null,null,null,null,null,null,null,null,null,514280,0]
[1704059,"Prótesis o tubo endoesofágico, colocación de (proc. aut.)",0,null,null,null,null,0,null,null,null,null,null,null,0,null,null,0,null,null,0,null,null,0,null,null,null,null,null,null,null,null,null,null,null,null,224490,0]
[1704060,"Reconstitución de tránsito en segundo tiempo (estómago o intestino) de operación cód. 17-04-057",0,null,null,null,null,0,null,null,null,null,null,null,0,null,null,0,null,null,0,null,null,0,null,null,null,null,null,null,null,null,null,null,null,null,381950,0]
[1704061,"Sutura herida o perforación esófago cervical",0,null,null,null,null,0,null,null,null,null,null,null,0,null,null,0,null,null,0,null,null,0,null,null,null,null,null,null,null,null,null,null,null,null,342100,0]
[1704062,"Sutura herida o perforación esófago torácico",0,null,null,null,null,0,null,null,null,null,null,null,0,null,null,0,null,null,0,null,null,0,null,null,null,null,null,null,null,null,null,null,null,null,433910,0]
[1704063,"Várices, ligadura directa",0,null,null,null,null,0,null,null,null,null,null,null,0,null,null,0,null,null,0,null,null,0,null,null,null,null,null,null,null,null,null,null,null,null,280120,0]
[null,"TOTAL ARANCEL MAI",{"$f":"SUM(C1806:C1869)","v":0},null,null,null,null,{"$f":"SUM(H1806:H1869)","v":0},0,0,0,0,0,0,0,0,0,0,0,0,0,0,0,0,0,0,0,0,0,0,0,0,0,0,0,0,19193930,0]
[null,"Instalación drenaje Pleural (cirugía)",0,null,null,null,null,{"$f":"+I1871+J1871","v":0},null,null,null,null,null,null,0,null,null,0,null,null,0,null,null,0]
[null,"Trasplante pulmón",0,null,null,null,null,0,null,null,null,null,null,null,{"$f":"SUM(P1872:Q1872)","v":0},null,null,{"$f":"SUM(S1872:T1872)","v":0},null,null,{"$f":"SUM(V1872:W1872)","v":0},null,null,{"$f":"SUM(Y1872:Z1872)","v":0}]
[null," TOTAL ARANCEL MLE Y NO ARANCELADO ",{"$f":"SUM(C1871:C1872)","v":0},null,null,null,null,{"$f":"SUM(H1871:H1872)","v":0},0,0,0,0,0,0,0,0,0,0,0,0,0,0,0,0,0,0,0,0,0,0,0,0,0,0,0,0]
[null," TOTAL PRODUCCION ",{"$f":"SUM(C1870+C1873)","v":0},null,null,null,null,{"$f":"SUM(H1870+H1873)","v":0},0,0,0,0,0,0,0,0,0,0,0,0,0,0,0,0,0,0,0,0,0,0,0,0,0,0,0,0,19193930,0]
[null,"Procedimientos gastroenterología"]
[1801037,"Ureasa, test de (para helicobacter pylori) o similar",{"$f":"SUM(D1876+G1876)","v":0},{"$f":"SUM(E1876:F1876)","v":0}]
[1801002,"Esofagoscopia",0,0]
[1801004,"Ano-recto-sigmoidoscopia en adultos",0,0]
[1801005,"Ano-recto-sigmoidescopia en niños (además anestesia cód. 22-01-001 si corresponde)",0,0]
[1801007,"Sigmoidoscopia y colonoscopia izquierda con tubo flexible",0,0]
[1801008,"Coledocoscopia intraoperatoria c/s extraccion de calculos",0,0]
[1801009,"Peritoneoscopia transparietal (incluye el neumoperitoneo)",0,0]
[1801010,"Test de  Bernstein",0,0]
[1801011,"Manometria esofagica",0,0]
[1801012,"Reflujo acido, test de (grossman o similar) o reflujo",0,0]
[1801013,"Sondeo gastrico con estimulacion de insulina (hollander)",0,0]
[1801014,"Vaciamiento gastrico, test de (goldstein o similar)",0,0]
[1801015,"Biopsia de intestino delgado, por capsula (de rubin,crosby o sim)",0,0]
[1801016,"Puncion biopsia transparietal de organos abdominales c/u",{"$f":"SUM(D1889+G1889)","v":0},{"$f":"SUM(E1889:F1889)","v":0}]
[1801018,"Colangiopancreatografia retrograda, por intubacion endoscopica con la ampolla de vater (incluye endoscopia) ",0,0]
[1801019,"Drenaje de la via biliar transhepatica y/o percutaneo (a.c.",0,0]
[1801020,"Fistulografia (a.c. 04-02-009)",0,0]
[1801021,"Neumoperitoneo por puncion transparietal",0,0]
[1801022,"Intubacion sonda de sengstaken",0,0]
[1801023,"Intubacion con sonda gastrica                                                                ",0,0]
[1801024,"Intubacion con sonda de miller-abbot o de alimentacion",0,0]
[1801025,"Dilatacion essofagica por balon neumatico (de mosher o similar)",0,0]
[1801026,"Dilatacion esofagica por bujia de hg (hurst o similar)",0,0]
[1801027,"Colocacion endoscopica de tubo  transtumoral en via biliar",0,0]
[1801028,"Cuerpo extrano de esofago y/o estomago, extraccion",0,0]
[1801029,"Devolvulacion del sigmoides por endoscopia (incluye ano-recto-sigmoidoscopia) (proc. Aut)",0,0]
[1801030,"Dilatacion ano-rectal, por sesion",0,0]
[1801031,"Polipos de esofago y/o estomago o intestino delgado,",0,0]
[1801045,"Polipos rectales, rectosigmoideos o de colon trat. Completo",0,0]
[1801032,"Escleroterapia de hemorroides, cualquier numero (incluye cod. 18-01-004 al 18-01-007 según corresp)",0,0]
[1801033,"Escleroterapia o hemostasia de varices esofagicas y/o ulcera",0,0]
[1801034,"Extraccion percutanea incruenta de calculos biliares",0,0]
[1801035,"Ligadura hemorroides",0,0]
[1801036,"Papilotomia endoscopica c/s extraccion de calculos, c/s",0,0]
[1801038,"Puncion evacuadora de absceso intraabdominales (hepatico u otros), c/s toma de muestra, c/s inyeccion de medicamentos",0,0]
[1801041,"Puncion evacuadora de liquido ascitico, con colocacion de expansores de plasma, c/s tomada de muestra, c/s inyeccion de medicamentos (no incluye el valor de los expansores ni otros medicamentos)",0,0]
[1801042,"Vaciamiento manual de fecaloma                                                                   ",0,0]
[1801043,"Manometria anorrectal",0,0]
[5099020,"Medición de pH gástrico",0,0]
[5099099,"Endosonografia rectal",0,0]
[5099100,"Endosonografia con punción",0,0]
[5099101,"Endosonografia compleja",0,0]
[5099102,"Endosonografia alta lineal",0,0]
[5099103,"Endosonografia alta radial",0,0]
[5099104,"Endosonografia con sonda radial",0,0]
[5099105,"Instalacion de sonda nasogastrica",0,0]
[5099106,"litotripsia biliar",0,0]
[5099107,"mucosectomia",0,0]
[5099108,"Dilatacion neumática de la acalasia por balón  ",0,0]
[null,"Escleroterapia várices con cionocrilato",0,0]
[null,"Hemostasia con endoclips",0,0]
[null,"Polipectomía colón",0,0]
[null,"Polipectomía gástrica / duodenal",0,0]
[null,"Cierre de fistula de esófago-colon-gástrica",0,0]
[null,"Coagulación Endoscópica con Argón plasma (digestivo alto y bajo)",0,0]
[null,"Dilatación de Estenosis Colonica",0,0]
[null,"Dilatación Pilórica y/o Estenosis Duodenal",0,0]
[null,"Instalación de Prótesis de Colon",0,0]
[null,"Instalación de Prótesis Duodenal",0,0]
[null,"Instalación de Prótesis Gástrica en Fístulas y Tumor",0,0]
[null,"Ligadura varices esofágicas",0,0]
[null,"Punción ascítica ",0,0]
[null," TOTAL",{"$f":"SUM(C1876:C1937)","v":0},{"$f":"SUM(D1876:D1937)","v":0},0,0,0,null,null,null,null,null,null,null,null,null,null,null,null,null,null,null,null,null,null,null,0,0,0,0,0,0,0,0,0,0]
[null,"GRUPO 18 : GASTROENTEROLOGIA      "]
[null,"PROC. DIAGNOSTICO Y TERAPEUTICO                             "]
[1801001,"Gastroduodenoscopía (incluye esofagoscopía)                                                      ",0,0,null,null,null,null,null,null,null,null,null,null,null,null,null,null,null,null,null,null,null,null,null,null,null,null,null,null,null,null,null,null,null,null,37130,{"$f":"AK1941*E1941","v":0}]
[1801003,"Enteroscopía",0,0,null,null,null,null,null,null,null,null,null,null,null,null,null,null,null,null,null,null,null,null,null,null,null,null,null,null,null,null,null,null,null,null,44780,{"$f":"AK1942*E1942","v":0}]
[1801006,"Colonoscopía larga (incluye sigmoidoscopía y colonoscopía izquierda)",0,0,null,null,null,null,null,null,null,null,null,null,null,null,null,null,null,null,null,null,null,null,null,null,null,null,null,null,null,null,null,null,null,null,47710,{"$f":"AK1943*E1943","v":0}]
[null,"TOTAL",{"$f":"SUM(C1941:C1943)","v":0},{"$f":"SUM(D1941:D1943)","v":0},{"$f":"SUM(E1941:E1943)","v":0},{"$f":"SUM(F1941:F1943)","v":0},{"$f":"SUM(G1941:G1943)","v":0},null,null,null,null,null,null,null,null,null,null,null,null,null,null,null,null,null,null,null,{"$f":"SUM(AA1941:AA1943)","v":0},0,0,0,0,0,0,0,0,0,129620,0]
[null,"CIRUGIA ABDOMINAL                                           "]
[1802001,"Diafragmática por vía abdominal o cualquiera otra hernia con uso de prótesis (no incluye el valor de la prótesis)",{"$f":"SUM(I1946:N1946)","v":0},null,null,null,null,{"$f":"+I1946+J1946","v":0},null,null,null,null,null,null,{"$f":"SUM(P1946:Q1946)","v":0},null,null,{"$f":"SUM(S1946:T1946)","v":0},null,null,{"$f":"SUM(V1946:W1946)","v":0},null,null,{"$f":"SUM(Y1946:Z1946)","v":0},null,null,null,null,null,null,null,null,null,null,null,null,263500,{"$f":"AK1946*I1946","v":0}]
[1802101,"Diafragmática por vía abdominal o cualquiera otra hernia con uso de prótesis (incluye el valor de la prótesis)",{"$f":"SUM(I1947:N1947)","v":0},null,null,null,null,0,null,null,null,null,null,null,{"$f":"SUM(P1947:Q1947)","v":0},null,null,{"$f":"SUM(S1947:T1947)","v":0},null,null,{"$f":"SUM(V1947:W1947)","v":0},null,null,{"$f":"SUM(Y1947:Z1947)","v":0},null,null,null,null,null,null,null,null,null,null,null,null,448690,0]
[1802002,"Incisional o evisceración post-op. sin resección intestinal",{"$f":"SUM(I1948:N1948)","v":0},null,null,null,null,0,null,null,null,null,null,null,{"$f":"SUM(P1948:Q1948)","v":0},null,null,{"$f":"SUM(S1948:T1948)","v":0},null,null,{"$f":"SUM(V1948:W1948)","v":0},null,null,{"$f":"SUM(Y1948:Z1948)","v":0},null,null,null,null,null,null,null,null,null,null,null,null,186340,0]
[1802003,"Inguinal, crural, umbilical, de la línea blanca o similares, recidivada o no, simple o estrangulada s/resección intest. c/u",0,null,null,null,null,0,null,null,null,null,null,null,0,null,null,0,null,null,0,null,null,0,null,null,null,null,null,null,null,null,null,null,null,null,170730,0]
[1802004,"Laparotomía exploradora, c/s liberación de adherencias, c/s drenaje, c/s biopsias como proc. aut. o como resultado de una herida penetrante abdominal no complicada o de un hemoperitoneo postoperatorio ...",0,null,null,null,null,0,null,null,null,null,null,null,0,null,null,0,null,null,0,null,null,0,null,null,null,null,null,null,null,null,null,null,null,null,159020,0]
[1802005,"Onfalocele (hasta 5 cms.); trat. quir.",0,null,null,null,null,0,null,null,null,null,null,null,0,null,null,0,null,null,0,null,null,0,null,null,null,null,null,null,null,null,null,null,null,null,172840,0]
[1802006,"Onfalocele (mas de 5 cms.); trat. quir.",0,null,null,null,null,0,null,null,null,null,null,null,0,null,null,0,null,null,0,null,null,0,null,null,null,null,null,null,null,null,null,null,null,null,201910,0]
[1802013,"Gastrosquisis",0,null,null,null,null,0,null,null,null,null,null,null,0,null,null,0,null,null,0,null,null,0,null,null,null,null,null,null,null,null,null,null,null,null,303100,0]
[1802007,"Peritonitis difusa aguda, trat. quir. (proc. aut.) ",0,null,null,null,null,0,null,null,null,null,null,null,0,null,null,0,null,null,0,null,null,0,null,null,null,null,null,null,null,null,null,null,null,null,224490,0]
[1802008,"Peritoneal (parietal)",0,null,null,null,null,0,null,null,null,null,null,null,0,null,null,0,null,null,0,null,null,0,null,null,null,null,null,null,null,null,null,null,null,null,172840,0]
[1802009,"Retroperitoneal",0,null,null,null,null,0,null,null,null,null,null,null,0,null,null,0,null,null,0,null,null,0,null,null,null,null,null,null,null,null,null,null,null,null,255650,0]
[1802010,"Antrectomía y vagotomía troncular o selectiva (proc. aut.)",0,null,null,null,null,0,null,null,null,null,null,null,0,null,null,0,null,null,0,null,null,0,null,null,null,null,null,null,null,null,null,null,null,null,342100,0]
[1802011,"Desgastrectomía y neoanastomosis, c/s vaguectomía",0,null,null,null,null,0,null,null,null,null,null,null,0,null,null,0,null,null,0,null,null,0,null,null,null,null,null,null,null,null,null,null,null,null,385930,0]
[1802012,"Gastroenteroanastomosis, cualquier técnica. (proc. aut.)",0,null,null,null,null,0,null,null,null,null,null,null,0,null,null,0,null,null,0,null,null,0,null,null,null,null,null,null,null,null,null,null,null,null,235180,0]
[1802014,"Gastrotomía y/o gastrostomía (proc. aut.)",0,null,null,null,null,0,null,null,null,null,null,null,0,null,null,0,null,null,0,null,null,0,null,null,null,null,null,null,null,null,null,null,null,null,152020,0]
[1802015,"Perforación gástrica aguda, trat. quir. (proc. aut.)",0,null,null,null,null,0,null,null,null,null,null,null,0,null,null,0,null,null,0,null,null,0,null,null,null,null,null,null,null,null,null,null,null,null,206590,0]
[1802016,"Piloroplastía (proc. aut.)",0,null,null,null,null,0,null,null,null,null,null,null,0,null,null,0,null,null,0,null,null,0,null,null,null,null,null,null,null,null,null,null,null,null,183230,0]
[1802017,"Gastrectomía sub-total distal: Con disección ganglionar",0,null,null,null,null,0,null,null,null,null,null,null,0,null,null,0,null,null,0,null,null,0,null,null,null,null,null,null,null,null,null,null,null,null,373260,0]
[1802018,"Gastrectomía sub-total distal: Sin disección ganglionar",0,null,null,null,null,0,null,null,null,null,null,null,0,null,null,0,null,null,0,null,null,0,null,null,null,null,null,null,null,null,null,null,null,null,321820,0]
[1802019,"Dumping y/o síndrome asa aferente, trat. quir.",0,null,null,null,null,0,null,null,null,null,null,null,0,null,null,0,null,null,0,null,null,0,null,null,null,null,null,null,null,null,null,null,null,null,368040,0]
[1802020,"Gastrectomía sub-total con vagotomía",0,null,null,null,null,0,null,null,null,null,null,null,0,null,null,0,null,null,0,null,null,0,null,null,null,null,null,null,null,null,null,null,null,null,342100,0]
[1802021,"Gastrectomía sub-total proximal con esófago-gastro-anastomosis u otra derivación",0,null,null,null,null,0,null,null,null,null,null,null,0,null,null,0,null,null,0,null,null,0,null,null,null,null,null,null,null,null,null,null,null,null,475500,0]
[1802022,"Gastrectomía total",0,null,null,null,null,0,null,null,null,null,null,null,0,null,null,0,null,null,0,null,null,0,null,null,null,null,null,null,null,null,null,null,null,null,475500,0]
[1802023,"Gastrectomía total o sub-total ampliada (incluye esplenectomía y pancreatectomía corporocaudal y disección ganglionar)",0,null,null,null,null,0,null,null,null,null,null,null,0,null,null,0,null,null,0,null,null,0,null,null,null,null,null,null,null,null,null,null,null,null,846250,0]
[1802024,"Gastropexia y/u otra cirugía antirreflujo, c/s vagotomía",0,null,null,null,null,0,null,null,null,null,null,null,0,null,null,0,null,null,0,null,null,0,null,null,null,null,null,null,null,null,null,null,null,null,281630,0]
[1802025,"Vagotomía selectiva y superselectiva c/s dren. gástrico, c/s piloroplastía (proc. aut.)",0,null,null,null,null,0,null,null,null,null,null,null,0,null,null,0,null,null,0,null,null,0,null,null,null,null,null,null,null,null,null,null,null,null,268670,0]
[1802079,"Gastrectomía total con ostomías proximal y distal",0,null,null,null,null,0,null,null,null,null,null,null,0,null,null,0,null,null,0,null,null,0,null,null,null,null,null,null,null,null,null,null,null,null,381970,0]
[1802080,"Reconstitución  de tránsito en 2° tiempo de operación código 18-02-079",0,null,null,null,null,0,null,null,null,null,null,null,0,null,null,0,null,null,0,null,null,0,null,null,null,null,null,null,null,null,null,null,null,null,329980,0]
[1802026,"Drenaje de colecciones líquidas hepáticas",0,null,null,null,null,0,null,null,null,null,null,null,0,null,null,0,null,null,0,null,null,0,null,null,null,null,null,null,null,null,null,null,null,null,253120,0]
[1802027,"Colangioenteroanastomosis intrahepática",0,null,null,null,null,0,null,null,null,null,null,null,0,null,null,0,null,null,0,null,null,0,null,null,null,null,null,null,null,null,null,null,null,null,505490,0]
[1802028,"Colecistectomía c/s colangiografía operatoria",0,null,null,null,null,0,null,null,null,null,null,null,0,null,null,0,null,null,0,null,null,0,null,null,null,null,null,null,null,null,null,null,null,null,279040,0]
[1802081,"Colecistectomía por videolaparoscopía, proc. completo",0,null,null,null,null,0,null,null,null,null,null,null,0,null,null,0,null,null,0,null,null,0,null,null,null,null,null,null,null,null,null,null,null,null,370360,0]
[1802029,"Colecistectomía y coledocostomía (sonda T y colangiografía postoperatoria) c/s colangiografía operatoria",0,null,null,null,null,0,null,null,null,null,null,null,0,null,null,0,null,null,0,null,null,0,null,null,null,null,null,null,null,null,null,null,null,null,299820,{"$f":"AK1978*I1978","v":0}]
[1802030,"Colecistogastroanastomosis o colecistoenteroanastomosis",0,null,null,null,null,0,null,null,null,null,null,null,0,null,null,0,null,null,0,null,null,0,null,null,null,null,null,null,null,null,null,null,null,null,346630,0]
[1802031,"Colecistostomía (proc. aut.)",0,null,null,null,null,0,null,null,null,null,null,null,0,null,null,0,null,null,0,null,null,0,null,null,null,null,null,null,null,null,null,null,null,null,172840,0]
[1802032,"Colédoco o hepatoenteroanastomosis",0,null,null,null,null,0,null,null,null,null,null,null,0,null,null,0,null,null,0,null,null,0,null,null,null,null,null,null,null,null,null,null,null,null,394050,0]
[1802033,"Coledocostomía supraduodenal o hepaticostomía (proc. aut.)",0,null,null,null,null,0,null,null,null,null,null,null,0,null,null,0,null,null,0,null,null,0,null,null,null,null,null,null,null,null,null,null,null,null,255650,0]
[1802034,"Colocación de válvula peritoneoyugular derivativa de ascitis",0,null,null,null,null,0,null,null,null,null,null,null,0,null,null,0,null,null,0,null,null,0,null,null,null,null,null,null,null,null,null,null,null,null,159020,0]
[1802035,"Desconexión acigoportal con transección esofágica",0,null,null,null,null,0,null,null,null,null,null,null,0,null,null,0,null,null,0,null,null,0,null,null,null,null,null,null,null,null,null,null,null,null,535120,0]
[1802036,"Desconexión ácigoportal sin transección esofágica",0,null,null,null,null,0,null,null,null,null,null,null,0,null,null,0,null,null,0,null,null,0,null,null,null,null,null,null,null,null,null,null,null,null,462310,0]
[1802037,"Drenaje vía biliar transhepático",0,null,null,null,null,0,null,null,null,null,null,null,0,null,null,0,null,null,0,null,null,0,null,null,null,null,null,null,null,null,null,null,null,null,253120,0]
[1802038,"Esfinteroplastía transduodenal, (proc. aut.)",0,null,null,null,null,0,null,null,null,null,null,null,0,null,null,0,null,null,0,null,null,0,null,null,null,null,null,null,null,null,null,null,null,null,342100,0]
[1802039,"Hepatectomía segmentaria (proc. aut.)",0,null,null,null,null,0,null,null,null,null,null,null,0,null,null,0,null,null,0,null,null,0,null,null,null,null,null,null,null,null,null,null,null,null,411940,0]
[1802040,"Herida traumática de hígado y/o vía biliar, trat. quir.",0,null,null,null,null,0,null,null,null,null,null,null,0,null,null,0,null,null,0,null,null,0,null,null,null,null,null,null,null,null,null,null,null,null,294630,0]
[1802041,"Lobectomía hepática (proc. aut.)",0,null,null,null,null,0,null,null,null,null,null,null,0,null,null,0,null,null,0,null,null,0,null,null,null,null,null,null,null,null,null,null,null,null,555860,0]
[1802042,"Quiste hidatídico, único o múltiple, y/o cistoyeyunoanastomosis, trat. quir.",0,null,null,null,null,0,null,null,null,null,null,null,0,null,null,0,null,null,0,null,null,0,null,null,null,null,null,null,null,null,null,null,null,null,300570,0]
[1802100,"Trasplante hepático",0,null,null,null,null,0,null,null,null,null,null,null,0,null,null,0,null,null,0,null,null,0,null,null,null,null,null,null,null,null,null,null,null,null,889550,0]
[1802043,"Abscesos, quistes, pseudoquistes o similares, trat. quir.",0,null,null,null,null,0,null,null,null,null,null,null,0,null,null,0,null,null,0,null,null,0,null,null,null,null,null,null,null,null,null,null,null,null,280120,0]
[1802044,"Heridas, traumatismos, trat. quir.",0,null,null,null,null,0,null,null,null,null,null,null,0,null,null,0,null,null,0,null,null,0,null,null,null,null,null,null,null,null,null,null,null,null,233820,0]
[1802045,"Pancreatectomía parcial",0,null,null,null,null,0,null,null,null,null,null,null,0,null,null,0,null,null,0,null,null,0,null,null,null,null,null,null,null,null,null,null,null,null,411940,0]
[1802046,"Pancreatectomía total c/s esplenectomía",0,null,null,null,null,0,null,null,null,null,null,null,0,null,null,0,null,null,0,null,null,0,null,null,null,null,null,null,null,null,null,null,null,null,607880,0]
[1802047,"Pancreatoduodenectomía",0,null,null,null,null,0,null,null,null,null,null,null,0,null,null,0,null,null,0,null,null,0,null,null,null,null,null,null,null,null,null,null,null,null,854190,0]
[1802048,"Secuestrectomía en pancreatitis aguda",0,null,null,null,null,0,null,null,null,null,null,null,0,null,null,0,null,null,0,null,null,0,null,null,null,null,null,null,null,null,null,null,null,null,343290,0]
[1802148,"Yeyunopancreatostomía",0,null,null,null,null,0,null,null,null,null,null,null,0,null,null,0,null,null,0,null,null,0,null,null,null,null,null,null,null,null,null,null,null,null,435620,0]
[1802049,"Autoimplante de bazo (incluye esplenectomía)",0,null,null,null,null,0,null,null,null,null,null,null,0,null,null,0,null,null,0,null,null,0,null,null,null,null,null,null,null,null,null,null,null,null,301590,0]
[1802050,"Esplenectomía total o parcial (proc. aut.)",0,null,null,null,null,0,null,null,null,null,null,null,0,null,null,0,null,null,0,null,null,0,null,null,null,null,null,null,null,null,null,null,null,null,253120,0]
[1802051,"Operación de etapificación (incluye esplenectomía, biopsias hepáticas, de ganglios abdominales y de cresta ilíaca)",0,null,null,null,null,0,null,null,null,null,null,null,0,null,null,0,null,null,0,null,null,0,null,null,null,null,null,null,null,null,null,null,null,null,352480,0]
[1802052,"Sutura esplénica (proc. aut.)",0,null,null,null,null,0,null,null,null,null,null,null,0,null,null,0,null,null,0,null,null,0,null,null,null,null,null,null,null,null,null,null,null,null,233820,0]
[1802053,"Apendicectomía y/o dren. absceso apendicular (proc. aut.)",0,null,null,null,null,0,null,null,null,null,null,null,0,null,null,0,null,null,0,null,null,0,null,null,null,null,null,null,null,null,null,null,null,null,190980,0]
[1802054,"Cierre de colostomía (proc. aut.)",0,null,null,null,null,0,null,null,null,null,null,null,0,null,null,0,null,null,0,null,null,0,null,null,null,null,null,null,null,null,null,null,null,null,172840,0]
[1802055,"Colostomía (proc. aut.)",0,null,null,null,null,0,null,null,null,null,null,null,0,null,null,0,null,null,0,null,null,0,null,null,null,null,null,null,null,null,null,null,null,null,183230,0]
[1802056,"Colostomía, complicaciones tardías, trat. quir.",0,null,null,null,null,0,null,null,null,null,null,null,0,null,null,0,null,null,0,null,null,0,null,null,null,null,null,null,null,null,null,null,null,null,216700,0]
[1802057,"Divertículo de Meckel, trat. quir.",0,null,null,null,null,0,null,null,null,null,null,null,0,null,null,0,null,null,0,null,null,0,null,null,null,null,null,null,null,null,null,null,null,null,164540,0]
[1802058,"Entero-enteroanastomosis o enterocoloanastomosis (proc. aut.)",0,null,null,null,null,0,null,null,null,null,null,null,0,null,null,0,null,null,0,null,null,0,null,null,null,null,null,null,null,null,null,null,null,null,213000,0]
[1802059,"Enterotomía o enterostomía (yeyunostomía u otra) (proc. aut.)",0,null,null,null,null,{"$f":"+I2010+J2010","v":0},null,null,null,null,null,null,0,null,null,0,null,null,0,null,null,0,null,null,null,null,null,null,null,null,null,null,null,null,152020,{"$f":"AK2010*I2010","v":0}]
[1802060,"Ileostomía terminal o en asa (proc. aut.)",0,null,null,null,null,0,null,null,null,null,null,null,0,null,null,0,null,null,0,null,null,0,null,null,null,null,null,null,null,null,null,null,null,null,201140,0]
[1802061,"Invaginación intestinal, trat. quir.",{"$f":"SUM(I2012:N2012)","v":0},null,null,null,null,0,null,null,null,null,null,null,{"$f":"SUM(P2012:Q2012)","v":0},null,null,{"$f":"SUM(S2012:T2012)","v":0},null,null,{"$f":"SUM(V2012:W2012)","v":0},null,null,{"$f":"SUM(Y2012:Z2012)","v":0},null,null,null,null,null,null,null,null,null,null,null,null,164540,0]
[1802062,"Persistencia conducto onfalomesentérico, trat. quir.",0,null,null,null,null,0,null,null,null,null,null,null,0,null,null,0,null,null,0,null,null,0,null,null,null,null,null,null,null,null,null,null,null,null,164540,0]
[1802063,"Quiste uraco, trat. quir.",0,null,null,null,null,0,null,null,null,null,null,null,0,null,null,0,null,null,0,null,null,0,null,null,null,null,null,null,null,null,null,null,null,null,164540,0]
[1802065,"Oclusión intestinal, trat. quir.:- Con resección",0,null,null,null,null,0,null,null,null,null,null,null,0,null,null,0,null,null,0,null,null,0,null,null,null,null,null,null,null,null,null,null,null,null,253070,0]
[1802066,"Oclusión intestinal, trat. quir.:- Sin resección",0,null,null,null,null,0,null,null,null,null,null,null,0,null,null,0,null,null,0,null,null,0,null,null,null,null,null,null,null,null,null,null,null,null,206590,0]
[1802067,"Colectomía parcial o hemicolectomía",0,null,null,null,null,0,null,null,null,null,null,null,0,null,null,0,null,null,0,null,null,0,null,null,null,null,null,null,null,null,null,null,null,null,394050,0]
[1802068,"Colectomía total abdominal",0,null,null,null,null,0,null,null,null,null,null,null,0,null,null,0,null,null,0,null,null,0,null,null,null,null,null,null,null,null,null,null,null,null,484670,0]
[1802069,"Descenso de colon c/conservación del esfínter, incluye resección de colon",0,null,null,null,null,0,null,null,null,null,null,null,0,null,null,0,null,null,0,null,null,0,null,null,null,null,null,null,null,null,null,null,null,null,474340,0]
[1802070,"Hartmann, operación de (o similar)",0,null,null,null,null,0,null,null,null,null,null,null,0,null,null,0,null,null,0,null,null,0,null,null,null,null,null,null,null,null,null,null,null,null,394050,0]
[1802071,"Perforación y/o herida de intestino, única o múltiple, trat. quir. (proc. aut.)",0,null,null,null,null,0,null,null,null,null,null,null,0,null,null,0,null,null,0,null,null,0,null,null,null,null,null,null,null,null,null,null,null,null,198850,0]
[1802072,"Quiste y/o tumor del mesenterio y/o epiplones, único y/o múltiple, trat. quir.",0,null,null,null,null,0,null,null,null,null,null,null,0,null,null,0,null,null,0,null,null,0,null,null,null,null,null,null,null,null,null,null,null,null,198850,0]
[1802073,"Reconstitución  tránsito post operación de Hartmann o sim.",0,null,null,null,null,0,null,null,null,null,null,null,0,null,null,0,null,null,0,null,null,0,null,null,null,null,null,null,null,null,null,null,null,null,394050,0]
[1802074,"Resección de intestino y enteroanastomosis (proc. aut.)",0,null,null,null,null,0,null,null,null,null,null,null,0,null,null,0,null,null,0,null,null,0,null,null,null,null,null,null,null,null,null,null,null,null,253200,0]
[1802082,"Resección intestinal con ostomías proximal y distal",0,null,null,null,null,0,null,null,null,null,null,null,0,null,null,0,null,null,0,null,null,0,null,null,null,null,null,null,null,null,null,null,null,null,242680,0]
[1802075,"Resección intestinal masiva por trombosis mesentérica u otra etiología",0,null,null,null,null,0,null,null,null,null,null,null,0,null,null,0,null,null,0,null,null,0,null,null,null,null,null,null,null,null,null,null,null,null,449320,0]
[1802076,"Duplicación intestinal, trat. quir.",0,null,null,null,null,0,null,null,null,null,null,null,0,null,null,0,null,null,0,null,null,0,null,null,null,null,null,null,null,null,null,null,null,null,253120,0]
[1802077,"Mal rotación intestinal, trat. quir.",0,null,null,null,null,0,null,null,null,null,null,null,0,null,null,0,null,null,0,null,null,0,null,null,null,null,null,null,null,null,null,null,null,null,253120,0]
[null,"Total ARANCEL MAI",{"$f":"SUM(C1946:C2028)","v":0},null,null,null,null,{"$f":"SUM(H1946:H2028)","v":0},0,0,0,0,0,0,0,0,0,0,0,0,0,0,0,0,0,0,0,0,0,0,0,0,0,0,0,0,26356000,0]
[5099005,"Gastrectomía en Manga o Gastrectomía Vertical Tipo Sleeve",0,null,null,null,null,{"$f":"+I2030+J2030","v":0},null,null,null,null,null,null,0,null,null,0,null,null,0,null,null,0]
[5099006,"Cirugía bariátrica con banda gástrica ajustable (Banding)",0,null,null,null,null,0,null,null,null,null,null,null,0,null,null,0,null,null,0,null,null,0]
[5099007,"Cirugía bariátrica con Balón Intragástrico",0,null,null,null,null,0,null,null,null,null,null,null,0,null,null,0,null,null,0,null,null,0]
[null,"Cirugía bariátrica con Bypass gástrico",0,null,null,null,null,0,null,null,null,null,null,null,0,null,null,0,null,null,0,null,null,0]
[null,"Cierre de fistula de esófago-colon-gástrica  cirugía",0,null,null,null,null,0,null,null,null,null,null,null,0,null,null,0,null,null,0,null,null,0]
[null,"TOTAL ARANCEL MLE Y NO ARANCELADO",{"$f":"SUM(C2030:C2034)","v":0},null,null,null,null,{"$f":"SUM(H2030:H2034)","v":0},0,0,0,0,0,0,0,0,0,0,0,0,0,0,0,0,0,0,0,0,0,0,0,0,0,0,0,0]
[null,"TOTAL PRODUCCION",{"$f":"SUM(C2029+C2035)","v":0},null,null,null,null,{"$f":"SUM(H2029+H2035)","v":0},0,0,0,0,0,0,0,0,0,0,0,0,0,0,0,0,0,0,0,0,0,0,0,0,0,0,0,0,26356000,0]
[null,"CIRUGIA PROCTOLOGICA                                 "]
[1803001,"Absceso anorrectal complejo (implica hospitalización y anestesia general)",{"$f":"SUM(I2038:N2038)","v":0},null,null,null,null,{"$f":"+I2038+J2038","v":0},null,null,null,null,null,null,{"$f":"SUM(P2038:Q2038)","v":0},null,null,{"$f":"SUM(S2038:T2038)","v":0},null,null,{"$f":"SUM(V2038:W2038)","v":0},null,null,{"$f":"SUM(Y2038:Z2038)","v":0},null,null,null,null,null,null,null,null,null,null,null,null,137580,{"$f":"AK2038*I2038","v":0}]
[1803002,"Absceso anorrectal simple, trat. quir.",{"$f":"SUM(I2039:N2039)","v":0},null,null,null,null,0,null,null,null,null,null,null,null,null,null,null,null,null,null,null,null,null,null,null,null,null,null,null,null,null,null,null,null,null,57940,0]
[1803003,"Absceso sacrocoxígeo, drenaje",{"$f":"SUM(I2040:N2040)","v":0},null,null,null,null,0,null,null,null,null,null,null,null,null,null,null,null,null,null,null,null,null,null,null,null,null,null,null,null,null,null,null,null,null,35110,0]
[1803004,"Biopsia quirúrgica rectal (proc. aut.)",0,null,null,null,null,0,null,null,null,null,null,null,{"$f":"SUM(P2041:Q2041)","v":0},null,null,{"$f":"SUM(S2041:T2041)","v":0},null,null,{"$f":"SUM(V2041:W2041)","v":0},null,null,{"$f":"SUM(Y2041:Z2041)","v":0},null,null,null,null,null,null,null,null,null,null,null,null,42240,0]
[1803005,"Criptectomía y/o papilectomía (cualquier número; proc. aut.)",0,null,null,null,null,0,null,null,null,null,null,null,null,null,null,null,null,null,null,null,null,null,null,null,null,null,null,null,null,null,null,null,null,null,35110,0]
[1803006,"Extracción por vía abdominal",0,null,null,null,null,0,null,null,null,null,null,null,0,null,null,0,null,null,0,null,null,0,null,null,null,null,null,null,null,null,null,null,null,null,221900,0]
[1803007,"Extracción por vía anal",0,null,null,null,null,0,null,null,null,null,null,null,null,null,null,null,null,null,null,null,null,null,null,null,null,null,null,null,null,null,null,null,null,null,50680,0]
[1803008,"Desgarros y heridas anorrectales, trat. quir- Con compromiso del esfínter",0,null,null,null,null,0,null,null,null,null,null,null,0,null,null,0,null,null,0,null,null,0,null,null,null,null,null,null,null,null,null,null,null,null,164190,0]
[1803009,"Desgarros y heridas anorrectales, trat. quir- Sin compromiso del esfínter",0,null,null,null,null,0,null,null,null,null,null,null,0,null,null,0,null,null,0,null,null,0,null,null,null,null,null,null,null,null,null,null,null,null,106500,0]
[1803010,"Esfinterotomía (proc. aut.)",0,null,null,null,null,0,null,null,null,null,null,null,0,null,null,0,null,null,0,null,null,0,null,null,null,null,null,null,null,null,null,null,null,null,65590,0]
[1803011,"Estenosis anal, plastía",0,null,null,null,null,0,null,null,null,null,null,null,0,null,null,0,null,null,0,null,null,0,null,null,null,null,null,null,null,null,null,null,null,null,123950,0]
[1803012,"Estenosis rectal, plastía",0,null,null,null,null,0,null,null,null,null,null,null,0,null,null,0,null,null,0,null,null,0,null,null,null,null,null,null,null,null,null,null,null,null,136450,0]
[1803013,"Fecaloma, trat. quir.",0,null,null,null,null,0,null,null,null,null,null,null,0,null,null,0,null,null,0,null,null,0,null,null,null,null,null,null,null,null,null,null,null,null,224810,0]
[1803014,"Fístula trat. quir. de:- Rectovesical",0,null,null,null,null,0,null,null,null,null,null,null,0,null,null,0,null,null,0,null,null,0,null,null,null,null,null,null,null,null,null,null,null,null,253120,0]
[1803015,"Fístula trat. quir. de:- Rectovaginal, rectouretral o uretrovaginal",0,null,null,null,null,0,null,null,null,null,null,null,0,null,null,0,null,null,0,null,null,0,null,null,null,null,null,null,null,null,null,null,null,null,221900,0]
[1803016,"Fístula trat. quir. de:- Anorrectal, de cualquier tipo",0,null,null,null,null,0,null,null,null,null,null,null,0,null,null,0,null,null,0,null,null,0,null,null,null,null,null,null,null,null,null,null,null,null,146540,0]
[1803017,"Fisura anal, repar. quir.",0,null,null,null,null,0,null,null,null,null,null,null,0,null,null,0,null,null,0,null,null,0,null,null,null,null,null,null,null,null,null,null,null,null,73370,0]
[1803018,"Hemorroidectomía (incluye otras operaciones complementarias en canal anal)",0,null,null,null,null,0,null,null,null,null,null,null,0,null,null,0,null,null,0,null,null,0,null,null,null,null,null,null,null,null,null,null,null,null,165480,0]
[1803019,"Hemorroides, trombectomía (proc. aut.)",0,null,null,null,null,0,null,null,null,null,null,null,null,null,null,null,null,null,null,null,null,null,null,null,null,null,null,null,null,null,null,null,null,null,23480,0]
[1803020,"Imperforación anal, reconstitución del tránsito- Por vía abdómino-perineal",0,null,null,null,null,0,null,null,null,null,null,null,0,null,null,0,null,null,0,null,null,0,null,null,null,null,null,null,null,null,null,null,null,null,274530,0]
[1803021,"Imperforación anal, reconstitución del tránsito- Por vía perineal",0,null,null,null,null,0,null,null,null,null,null,null,0,null,null,0,null,null,0,null,null,0,null,null,null,null,null,null,null,null,null,null,null,null,164540,0]
[1803022,"Imperforación anal, reconstitución del tránsito- Por vía sagital posterior",0,null,null,null,null,0,null,null,null,null,null,null,0,null,null,0,null,null,0,null,null,0,null,null,null,null,null,null,null,null,null,null,null,null,249540,0]
[1803023,"Incontinencia anal, trat. quir. de- Con cerclaje",0,null,null,null,null,0,null,null,null,null,null,null,0,null,null,0,null,null,0,null,null,0,null,null,null,null,null,null,null,null,null,null,null,null,146540,0]
[1803024,"Incontinencia anal, trat. quir. de- Con plastía muscular",0,null,null,null,null,0,null,null,null,null,null,null,0,null,null,0,null,null,0,null,null,0,null,null,null,null,null,null,null,null,null,null,null,null,204000,0]
[1803025,"Pólipo rectal, trat. quir.- Por vía abdominal",0,null,null,null,null,0,null,null,null,null,null,null,0,null,null,0,null,null,0,null,null,0,null,null,null,null,null,null,null,null,null,null,null,null,221900,0]
[1803026,"Pólipo rectal, trat. quir.- Por vía anal",0,null,null,null,null,0,null,null,null,null,null,null,0,null,null,0,null,null,0,null,null,0,null,null,null,null,null,null,null,null,null,null,null,null,137580,0]
[1803027,"Prolapso rectal, trat. quir.- Por vía abdominal",0,null,null,null,null,0,null,null,null,null,null,null,0,null,null,0,null,null,0,null,null,0,null,null,null,null,null,null,null,null,null,null,null,null,247870,0]
[1803028,"Prolapso rectal, trat. quir.- Por vía anal",0,null,null,null,null,0,null,null,null,null,null,null,0,null,null,0,null,null,0,null,null,0,null,null,null,null,null,null,null,null,null,null,null,null,152020,0]
[1803029,"Panproctocolectomía (2 equipos)",0,null,null,null,null,0,null,null,null,null,null,null,0,null,null,0,null,null,0,null,null,0,null,null,null,null,null,null,null,null,null,null,null,null,607880,0]
[1803030,"Prurito anal, trat. quir. por denervación",0,null,null,null,null,0,null,null,null,null,null,null,0,null,null,0,null,null,0,null,null,0,null,null,null,null,null,null,null,null,null,null,null,null,77160,0]
[1803031,"Quiste sacrocoxígeo, trat. quir.",0,null,null,null,null,0,null,null,null,null,null,null,0,null,null,0,null,null,0,null,null,0,null,null,null,null,null,null,null,null,null,null,null,null,152020,0]
[1803032,"Resección abdómino-perineal de ano y recto (2 equipos)",0,null,null,null,null,0,null,null,null,null,null,null,0,null,null,0,null,null,0,null,null,0,null,null,null,null,null,null,null,null,null,null,null,null,433910,0]
[1803033,"Resección abdómino-perineal de ano y recto ampliada (2 equipos) (incluye genitales femeninos)",0,null,null,null,null,0,null,null,null,null,null,null,0,null,null,0,null,null,0,null,null,0,null,null,null,null,null,null,null,null,null,null,null,null,503910,0]
[1803034,"Resección anterior de recto",0,null,null,null,null,0,null,null,null,null,null,null,0,null,null,0,null,null,0,null,null,0,null,null,null,null,null,null,null,null,null,null,null,null,352480,0]
[1803035,"Resección perineal de ano y recto",0,null,null,null,null,0,null,null,null,null,null,null,0,null,null,0,null,null,0,null,null,0,null,null,null,null,null,null,null,null,null,null,null,null,287220,0]
[1803036,"A los cirujanos del equipo perineal en cada intervención anterior",0,null,null,null,null,0,null,null,null,null,null,null,null,null,null,null,null,null,null,null,null,null,null,null,null,null,null,null,null,null,null,null,null,null,155920,0]
[1803038,"Condilomas anales, trat. quir. (para electrofulguración ver cód. 16-01-006)",0,null,null,null,null,0,null,null,null,null,null,null,0,null,null,0,null,null,0,null,null,0,null,null,null,null,null,null,null,null,null,null,null,null,114050,0]
[null,"TOTAL",{"$f":"SUM(C2038:C2074)","v":0},null,null,null,null,{"$f":"SUM(H2038:H2074)","v":0},0,0,0,0,0,0,0,0,0,0,0,0,0,0,0,0,0,0,0,0,0,0,0,0,0,0,0,0,6769010,{"$f":"SUM(AL2038:AL2074)","v":0}]
["PROCEDIMIENTOS DE UROLOGÍA Y NEFROLOGÍA"]
[1901001,"Exploracion de uretra antero-posterior con bujia y/o explo -",{"$f":"SUM(D2077+G2077)","v":0},{"$f":"SUM(E2077:F2077)","v":0}]
[1901002,"Cistoscopia con sondeo de uno o ambos ureteres",0,0]
[1901003,"Cistoscopia y/o uretrocistoscopia y/o uretroscopia",0,0]
[1901004,"Ureteronefroscopia",0,0]
[1901005,"Prostatica transparietal o transrectal (ademas anestesia",0,0]
[1901006,"Renal transparietal",0,0]
[1901007,"Cistometria (proc.aut.)",0,0]
[1901008,"Electromiografia perineal y del esfinter uretral en adultos",0,0]
[1901009,"Electromiografia perineal y del esfinter uretral en ninos",0,0]
[1901010,"Perfil uretral (proc.aut.)",0,0]
[1901011,"Uroflujometria (proc.aut.)",0,0]
[1901030,"Estudio urodinamico (incluye cistometria, emg perineal y del",{"$f":"SUM(D2088+G2088)","v":0},{"$f":"SUM(E2088:F2088)","v":0}]
[1901012,"Cistografia por sonda (de relleno) o por puncion  hipo-",0,0]
[1901013,"Inyeccion de medio de contraste en cuerpo cavernoso",0,0]
[1901015,"Ureteropielografia ascendente (directa) por cateterismo",0,0]
[1901016,"Uretrografia retrograda o cistouretrografia (miccional)",0,0]
[1901018,"Dilatacion uretra c/s masaje, c/s instilacion o inyeccion de",0,0]
[1901019,"Instilacion vesical (incluye colocacion de sonda) proc. Aut.                                      ",0,0]
[1901020,"Inyeccion de medicamentos en el pene",0,0]
[1901021,"Vac. Vesical p/puncion hipogastrica o cistostomia p/puncion",0,0]
[1901022,"Vac. Vesical por sonda uretral, (proc. Aut.)                                                    ",0,0]
[5099110,"Procedimiento hemodinamia-ablacion renal   ",0,0]
[" 5099109 ","Instalacion de sonda vesical ",0,0]
[null,"Extracción percutánea de calculos renales ",0,0]
[null,"Plasmaferesis en patología renal",0,0]
[null,"TOTAL PRODUCCION",{"$f":"SUM(C2077:C2101)","v":0},{"$f":"SUM(D2077:D2101)","v":0},{"$f":"SUM(E2077:E2101)","v":0},{"$f":"SUM(F2077:F2101)","v":0},{"$f":"SUM(G2077:G2101)","v":0},null,null,null,null,null,null,null,null,null,null,null,null,null,null,null,null,null,null,null,{"$f":"SUM(AA2077:AA2101)","v":0},0,0,0,0,0,0,0,0,0]
[null,"GRUPO 19 : UROLOGIA Y NEFROLOGIA   "]
[null,"DIALISIS                                                    "]
[1901023,"Hemodiálisis con insumos incluidos",0,0,null,null,null,null,null,null,null,null,null,null,null,null,null,null,null,null,null,null,null,null,null,null,null,null,null,null,null,null,null,null,null,null,45790,{"$f":"AK2105*E2105","v":0}]
[1901024,"Hemodiálisis sin insumos",0,0,null,null,null,null,null,null,null,null,null,null,null,null,null,null,null,null,null,null,null,null,null,null,null,null,null,null,null,null,null,null,null,null,28790,0]
[1901025,"Peritoneodiálisis  (incluye insumos)",0,0,null,null,null,null,null,null,null,null,null,null,null,null,null,null,null,null,null,null,null,null,null,null,null,null,null,null,null,null,null,null,null,null,29650,0]
[1901026,"Peritoneodiálisis continua en paciente crónico (adulto o niños) (tratamiento mensual)",0,0,null,null,null,null,null,null,null,null,null,null,null,null,null,null,null,null,null,null,null,null,null,null,null,null,null,null,null,null,null,null,null,null,889830,0]
[1901126,"Instalación de cateter para peritoneodiális",0,0,null,null,null,null,null,null,null,null,null,null,null,null,null,null,null,null,null,null,null,null,null,null,null,null,null,null,null,null,null,null,null,null,404170,0]
[1901027,"Hemodiálisis, tratamiento mensual (con insumos incluidos)",0,0,null,null,null,null,null,null,null,null,null,null,null,null,null,null,null,null,null,null,null,null,null,null,null,null,null,null,null,null,null,null,null,null,618020,0]
[1901028,"Hemodiálisis con bicarbonato con insumos (por sesion)",0,0,null,null,null,null,null,null,null,null,null,null,null,null,null,null,null,null,null,null,null,null,null,null,null,null,null,null,null,null,null,null,null,null,55720,0]
[1901029,"Hemodiálisis con bicarbonato con insumos (tratamiento mensual)",0,0,null,null,null,null,null,null,null,null,null,null,null,null,null,null,null,null,null,null,null,null,null,null,null,null,null,null,null,null,null,null,null,null,724410,0]
[null,"TOTAL",{"$f":"SUM(C2105:C2112)","v":0},0,0,0,0,null,null,null,null,null,null,null,null,null,null,null,null,null,null,null,null,null,null,null,{"$f":"SUM(AA2105:AA2112)","v":0},0,0,0,0,0,0,0,0,0,2796380,0]
[null,"CIRUGIA UROLOGICA Y SUPRARRENAL                           "]
[1902001,"Absceso perinefrítico, vaciamiento",{"$f":"SUM(I2115:N2115)","v":0},null,null,null,null,{"$f":"+I2115+J2115","v":0},null,null,null,null,null,null,{"$f":"SUM(P2115:Q2115)","v":0},null,null,{"$f":"SUM(S2115:T2115)","v":0},null,null,{"$f":"SUM(V2115:W2115)","v":0},null,null,{"$f":"SUM(Y2115:Z2115)","v":0},null,null,null,null,null,null,null,null,null,null,null,null,190740,{"$f":"AK2115*I2115","v":0}]
[1902002,"Arterias renales, operaciones sobre (proc. aut.)",{"$f":"SUM(I2116:N2116)","v":0},null,null,null,null,0,null,null,null,null,null,null,{"$f":"SUM(P2116:Q2116)","v":0},null,null,{"$f":"SUM(S2116:T2116)","v":0},null,null,{"$f":"SUM(V2116:W2116)","v":0},null,null,{"$f":"SUM(Y2116:Z2116)","v":0},null,null,null,null,null,null,null,null,null,null,null,null,504060,0]
[1902003,"Auto o heterotrasplante",{"$f":"SUM(I2117:N2117)","v":0},null,null,null,null,0,null,null,null,null,null,null,{"$f":"SUM(P2117:Q2117)","v":0},null,null,{"$f":"SUM(S2117:T2117)","v":0},null,null,{"$f":"SUM(V2117:W2117)","v":0},null,null,{"$f":"SUM(Y2117:Z2117)","v":0},null,null,null,null,null,null,null,null,null,null,null,null,696260,0]
[1902004,"Cirugía de banco, (proc. completo) (micro-extracorpórea), autotrasplante",0,null,null,null,null,0,null,null,null,null,null,null,{"$f":"SUM(P2118:Q2118)","v":0},null,null,{"$f":"SUM(S2118:T2118)","v":0},null,null,{"$f":"SUM(V2118:W2118)","v":0},null,null,{"$f":"SUM(Y2118:Z2118)","v":0},null,null,null,null,null,null,null,null,null,null,null,null,677400,0]
[1902005,"Litiasis renal, trat. quir. percutáneo c/s ultrasonido (incluye todo el procedimiento)",0,null,null,null,null,0,null,null,null,null,null,null,0,null,null,0,null,null,0,null,null,0,null,null,null,null,null,null,null,null,null,null,null,null,375270,0]
[1902090,"Tratamiento integral litiasis urinaria por vía litotripsia extracorpórea",0,null,null,null,null,0,null,null,null,null,null,null,0,null,null,0,null,null,0,null,null,0,null,null,null,null,null,null,null,null,null,null,null,null,464990,0]
[1902006,"Litiasis renal o ureteral  por cirugía abierta o laparoscópica, por pielotomía o nefrotomía mínima o anatrófica.",0,null,null,null,null,0,null,null,null,null,null,null,0,null,null,0,null,null,0,null,null,0,null,null,null,null,null,null,null,null,null,null,null,null,320660,0]
[1902008,"Lumbotomía exploradora c/s dren., c/s biopsia (proc. aut.)",0,null,null,null,null,0,null,null,null,null,null,null,0,null,null,0,null,null,0,null,null,0,null,null,null,null,null,null,null,null,null,null,null,null,206590,0]
[1902009,"Nefrectomía parcial cualquier vía y técnica. Incluye disección ganglionar etapificadora o reductiva",0,null,null,null,null,0,null,null,null,null,null,null,0,null,null,0,null,null,0,null,null,0,null,null,null,null,null,null,null,null,null,null,null,null,506530,0]
[1902010,"Nefrectomía radical ampliada (incluye ganglios)",0,null,null,null,null,0,null,null,null,null,null,null,0,null,null,0,null,null,0,null,null,0,null,null,null,null,null,null,null,null,null,null,null,null,506530,0]
[1902011,"Nefrectomía por patología benigna o malformación o trasplante.",0,null,null,null,null,0,null,null,null,null,null,null,0,null,null,0,null,null,0,null,null,0,null,null,null,null,null,null,null,null,null,null,null,null,263500,0]
[1902012,"Drenaje percutáneo o endoscópico de hidronefrosis.  (proc.autónomo)",0,null,null,null,null,0,null,null,null,null,null,null,0,null,null,0,null,null,0,null,null,0,null,null,null,null,null,null,null,null,null,null,null,null,237470,0]
[1902013,"Pielotomía exploradora y/o terapéutica (incluye la  pielostomía y/o pieloplastía)",0,null,null,null,null,0,null,null,null,null,null,null,0,null,null,0,null,null,0,null,null,0,null,null,null,null,null,null,null,null,null,null,null,null,330980,0]
[1902014,"Suprarrenalectomía bilateral",0,null,null,null,null,0,null,null,null,null,null,null,0,null,null,0,null,null,0,null,null,0,null,null,null,null,null,null,null,null,null,null,null,null,420040,0]
[1902015,"Suprarrenalectomía unilateral",0,null,null,null,null,0,null,null,null,null,null,null,0,null,null,0,null,null,0,null,null,0,null,null,null,null,null,null,null,null,null,null,null,null,320660,0]
[1902016,"Anastomosis de los uréteres",0,null,null,null,null,0,null,null,null,null,null,null,0,null,null,0,null,null,0,null,null,0,null,null,null,null,null,null,null,null,null,null,null,null,352480,0]
[1902017,"Fístula urétero-vaginal, trat. quir.",0,null,null,null,null,0,null,null,null,null,null,null,0,null,null,0,null,null,0,null,null,0,null,null,null,null,null,null,null,null,null,null,null,null,294630,0]
[1902018,"Nefroureterectomía en patología tumoral o malformación, cualquier vía o técnica.",0,null,null,null,null,0,null,null,null,null,null,null,0,null,null,0,null,null,0,null,null,0,null,null,null,null,null,null,null,null,null,null,null,null,424560,0]
[1902019,"Ureterectomía",0,null,null,null,null,0,null,null,null,null,null,null,0,null,null,0,null,null,0,null,null,0,null,null,null,null,null,null,null,null,null,null,null,null,305060,0]
[1902020,"Urétero-litotomía abierta",0,null,null,null,null,0,null,null,null,null,null,null,0,null,null,0,null,null,0,null,null,0,null,null,null,null,null,null,null,null,null,null,null,null,229990,0]
[1902021,"Urétero o negro-litotomía endoscópica c/ureteroscopía rigida o flexible, con o sin fragmentación.",0,null,null,null,null,0,null,null,null,null,null,null,0,null,null,0,null,null,0,null,null,0,null,null,null,null,null,null,null,null,null,null,null,null,464990,0]
[1902022,"Ureterectomía, ureteroplastia, ureterorrafia, ureterolisis, transureteroanastomosis, cualquier vía o técnica. ",0,null,null,null,null,0,null,null,null,null,null,null,0,null,null,0,null,null,0,null,null,0,null,null,null,null,null,null,null,null,null,null,null,null,352480,0]
[1902023,"Uréterorrafia y/o uréterolisis c/u",0,null,null,null,null,0,null,null,null,null,null,null,0,null,null,0,null,null,0,null,null,0,null,null,null,null,null,null,null,null,null,null,null,null,253120,0]
[1902024,"Ureterostomía bilateral: vesical, cutánea o intestinal",0,null,null,null,null,0,null,null,null,null,null,null,0,null,null,0,null,null,0,null,null,0,null,null,null,null,null,null,null,null,null,null,null,null,440850,0]
[1902025,"Ureterostomía unilateral: vesical, cutánea o intestinal",0,null,null,null,null,0,null,null,null,null,null,null,0,null,null,0,null,null,0,null,null,0,null,null,null,null,null,null,null,null,null,null,null,null,330980,0]
[1902027,"Cistectomía parcial y/o trat. quir. de divertículo vesical",0,null,null,null,null,0,null,null,null,null,null,null,0,null,null,0,null,null,0,null,null,0,null,null,null,null,null,null,null,null,null,null,null,null,242680,0]
[1902028,"Cistectomía radical, cualquier vía o técnica, incluye linfadenectomía ampliada.",0,null,null,null,null,0,null,null,null,null,null,null,0,null,null,0,null,null,0,null,null,0,null,null,null,null,null,null,null,null,null,null,null,null,662830,0]
[1902029,"Cistoplastía, proc. completo",0,null,null,null,null,0,null,null,null,null,null,null,0,null,null,0,null,null,0,null,null,0,null,null,null,null,null,null,null,null,null,null,null,null,440850,0]
[1902030,"Reparación vesical por trauma o daño de cualquier tipo.",0,null,null,null,null,0,null,null,null,null,null,null,0,null,null,0,null,null,0,null,null,0,null,null,null,null,null,null,null,null,null,null,null,null,164540,0]
[1902031,"Cistostomía  c/s extracción de cuerpo extraño c/s instalación de cateter suprapúbico",0,null,null,null,null,0,null,null,null,null,null,null,0,null,null,0,null,null,0,null,null,0,null,null,null,null,null,null,null,null,null,null,null,null,164540,0]
[1902032,"Extrofia vesical, proc. completo",0,null,null,null,null,0,null,null,null,null,null,null,0,null,null,0,null,null,0,null,null,0,null,null,null,null,null,null,null,null,null,null,null,null,320630,0]
[1902033,"Fístula vésico-cutánea, y/o vaginal, y/o intest., trat. quir.",0,null,null,null,null,0,null,null,null,null,null,null,0,null,null,0,null,null,0,null,null,0,null,null,null,null,null,null,null,null,null,null,null,null,247870,0]
[1902034,"Cirugía abierta o endoscópica de lesiones cuello vesical y/o hemovejiga primaria o post cirugía próstata o vejiga",0,null,null,null,null,0,null,null,null,null,null,null,0,null,null,0,null,null,0,null,null,0,null,null,null,null,null,null,null,null,null,null,null,null,201140,{"$f":"AK2147*I2147","v":0}]
[1902035,"Ligadura de arterias hipogástricas (proc. aut.)",0,null,null,null,null,0,null,null,null,null,null,null,0,null,null,0,null,null,0,null,null,0,null,null,null,null,null,null,null,null,null,null,null,null,198850,0]
[1902036,"Operación de Bricker",0,null,null,null,null,0,null,null,null,null,null,null,0,null,null,0,null,null,0,null,null,0,null,null,null,null,null,null,null,null,null,null,null,null,483660,0]
[1902037,"Resección endoscópica de cáncer vesical",0,null,null,null,null,0,null,null,null,null,null,null,0,null,null,0,null,null,0,null,null,0,null,null,null,null,null,null,null,null,null,null,null,null,264140,0]
[1902038,"Reservorio continente intestinal externo o interno",0,null,null,null,null,0,null,null,null,null,null,null,0,null,null,0,null,null,0,null,null,0,null,null,null,null,null,null,null,null,null,null,null,null,440850,0]
[1902040,"Extirpación divertículo o quiste para-uretral, cualquier vía",0,null,null,null,null,0,null,null,null,null,null,null,0,null,null,0,null,null,0,null,null,0,null,null,null,null,null,null,null,null,null,null,null,null,253120,0]
[1902041,"Flegmón urinoso, drenaje y cistostomía",0,null,null,null,null,0,null,null,null,null,null,null,0,null,null,0,null,null,0,null,null,0,null,null,null,null,null,null,null,null,null,null,null,null,183230,0]
[1902042,"Glándulas de Cowper, lesiones de las, trat. quir.",0,null,null,null,null,0,null,null,null,null,null,null,0,null,null,0,null,null,0,null,null,0,null,null,null,null,null,null,null,null,null,null,null,null,118920,0]
[1902043,"Uretroplastía sin substitución - uretrorrafía",0,null,null,null,null,0,null,null,null,null,null,null,0,null,null,0,null,null,0,null,null,0,null,null,null,null,null,null,null,null,null,null,null,null,198850,0]
[1902044,"Uretroplastía de substitución, cada tiempo",0,null,null,null,null,0,null,null,null,null,null,null,0,null,null,0,null,null,0,null,null,0,null,null,null,null,null,null,null,null,null,null,null,null,247870,0]
[1902045,"Incontinencia urinaria de esfuerzo o d.i.e. (disfunción intrínseca del esfinter), cualquier vía única o combinada, con o sin instalación de mallas, elementos protésicos o esfínter artificial.",0,null,null,null,null,0,null,null,null,null,null,null,0,null,null,0,null,null,0,null,null,0,null,null,null,null,null,null,null,null,null,null,null,null,235580,0]
[1902046,"Meatotomía mujer",0,null,null,null,null,0,null,null,null,null,null,null,0,null,null,0,null,null,0,null,null,0,null,null,null,null,null,null,null,null,null,null,null,null,44890,0]
[1902047,"Meatotomía quirúrgica c/s resección de pólipo o carúncula",0,null,null,null,null,0,null,null,null,null,null,null,0,null,null,0,null,null,0,null,null,0,null,null,null,null,null,null,null,null,null,null,null,null,118920,0]
[1902048,"Pólipo meato, electrocoagulación",0,null,null,null,null,0,null,null,null,null,null,null,0,null,null,0,null,null,0,null,null,0,null,null,null,null,null,null,null,null,null,null,null,null,37060,0]
[1902049,"Uretrectomía y /o plastía  abierta de uretra posterior por  trauma o, estenosis  o cualquier etiología",0,null,null,null,null,0,null,null,null,null,null,null,0,null,null,0,null,null,0,null,null,0,null,null,null,null,null,null,null,null,null,null,null,null,240070,0]
[1902050,"Fistulectomía ",0,null,null,null,null,0,null,null,null,null,null,null,0,null,null,0,null,null,0,null,null,0,null,null,null,null,null,null,null,null,null,null,null,null,143100,0]
[1902051,"Uretrostomía",0,null,null,null,null,0,null,null,null,null,null,null,0,null,null,0,null,null,0,null,null,0,null,null,null,null,null,null,null,null,null,null,null,null,124340,0]
[1902052,"Uretrotomía externa (proc. aut.)",0,null,null,null,null,0,null,null,null,null,null,null,0,null,null,0,null,null,0,null,null,0,null,null,null,null,null,null,null,null,null,null,null,null,143100,0]
[1902053,"Uretrotomía interna y/o uretrolitotomía (proc. aut.)",0,null,null,null,null,0,null,null,null,null,null,null,0,null,null,0,null,null,0,null,null,0,null,null,null,null,null,null,null,null,null,null,null,null,156580,0]
[1902054,"Tratamiento quirúrgico de absceso prostático y/o vesículas seminales, cualquier vía o técnica",0,null,null,null,null,0,null,null,null,null,null,null,0,null,null,0,null,null,0,null,null,0,null,null,null,null,null,null,null,null,null,null,null,null,137580,0]
[1902055,"Adenoma o cáncer prostático, resección endoscópica desobstructiva, cualquier técnica (uni, bipolar, láser u otros)",0,null,null,null,null,0,null,null,null,null,null,null,0,null,null,0,null,null,0,null,null,0,null,null,null,null,null,null,null,null,null,null,null,null,258240,0]
[1902056,"Adenoma prostático, trat. quir. cualquier vía o técnica abierta",0,null,null,null,null,0,null,null,null,null,null,null,0,null,null,0,null,null,0,null,null,0,null,null,null,null,null,null,null,null,null,null,null,null,284240,0]
[1902057,"Prostatectomía radical por cáncer prostáctico, cualquier vía o técnica, incluye linfadenectomía si corresponde ",0,null,null,null,null,0,null,null,null,null,null,null,0,null,null,0,null,null,0,null,null,0,null,null,null,null,null,null,null,null,null,null,null,null,506530,0]
[1902058,"Vesiculostomía diagnóstica y/o terapéutica",0,null,null,null,null,0,null,null,null,null,null,null,0,null,null,0,null,null,0,null,null,0,null,null,null,null,null,null,null,null,null,null,null,null,137580,0]
[1902059,"Biopsia quirúrgica de testículo y/o aspiración epididimaria.",0,null,null,null,null,0,null,null,null,null,null,null,0,null,null,0,null,null,0,null,null,0,null,null,null,null,null,null,null,null,null,null,null,null,137580,0]
[1902060,"Descenso testicular con o sin hernia, cualquier tiempo, cualquier técnica",0,null,null,null,null,0,null,null,null,null,null,null,0,null,null,0,null,null,0,null,null,0,null,null,null,null,null,null,null,null,null,null,null,null,189400,0]
[1902061,"Descenso testículo inguinal c/s hernioplastía",0,null,null,null,null,0,null,null,null,null,null,null,0,null,null,0,null,null,0,null,null,0,null,null,null,null,null,null,null,null,null,null,null,null,161800,0]
[1902062,"Escroto, plastía de, proc. completo",0,null,null,null,null,0,null,null,null,null,null,null,0,null,null,0,null,null,0,null,null,0,null,null,null,null,null,null,null,null,null,null,null,null,146540,0]
[1902063,"Hidatidectomía unilat. c/s eversión de la vaginal (proc. aut.)",0,null,null,null,null,0,null,null,null,null,null,null,0,null,null,0,null,null,0,null,null,0,null,null,null,null,null,null,null,null,null,null,null,null,137580,0]
[1902064,"Hidrocele y/o hematocele. Incluye quistes cordón y/o epidídimo y/o hidatidectomías y/o cirugía intravaginal del mismo lado ",0,null,null,null,null,0,null,null,null,null,null,null,0,null,null,0,null,null,0,null,null,0,null,null,null,null,null,null,null,null,null,null,null,null,137580,0]
[1902065,"Orquidectomía un lado",0,null,null,null,null,0,null,null,null,null,null,null,0,null,null,0,null,null,0,null,null,0,null,null,null,null,null,null,null,null,null,null,null,null,137580,0]
[1902066,"Orquidopexia  un lado",0,null,null,null,null,0,null,null,null,null,null,null,0,null,null,0,null,null,0,null,null,0,null,null,null,null,null,null,null,null,null,null,null,null,137580,0]
[1902067,"Prótesis testicular, (proc. aut.)",0,null,null,null,null,{"$f":"+I2179+J2179","v":0},null,null,null,null,null,null,0,null,null,0,null,null,0,null,null,0,null,null,null,null,null,null,null,null,null,null,null,null,137580,{"$f":"AK2179*I2179","v":0}]
[1902068,"Orquidectomía ampliada por cáncer testicular",0,null,null,null,null,0,null,null,null,null,null,null,0,null,null,0,null,null,0,null,null,0,null,null,null,null,null,null,null,null,null,null,null,null,170730,0]
[1902069,"Disección ganglionar lumboaórtica por cáncer testicular. Cualquier vía o técnica, uni o bilateral o modificada.",{"$f":"SUM(I2181:N2181)","v":0},null,null,null,null,0,null,null,null,null,null,null,0,null,null,0,null,null,0,null,null,0,null,null,null,null,null,null,null,null,null,null,null,null,475500,0]
[1902070,"Anastomosis deferentes o epididimo-deferencial",0,null,null,null,null,0,null,null,null,null,null,null,{"$f":"SUM(P2182:Q2182)","v":0},null,null,{"$f":"SUM(S2182:T2182)","v":0},null,null,{"$f":"SUM(V2182:W2182)","v":0},null,null,{"$f":"SUM(Y2182:Z2182)","v":0},null,null,null,null,null,null,null,null,null,null,null,null,219630,0]
[1902071,"Cirugía del epidídimo y cordón (proc.aut), incluye cirugía intravaginal y/o varicocele mismo lado",0,null,null,null,null,0,null,null,null,null,null,null,0,null,null,0,null,null,0,null,null,0,null,null,null,null,null,null,null,null,null,null,null,null,151390,0]
[1902072,"Plastía epidídimo-deferente (operación de Martín o sim.)",0,null,null,null,null,0,null,null,null,null,null,null,0,null,null,0,null,null,0,null,null,0,null,null,null,null,null,null,null,null,null,null,null,null,219630,0]
[1902073,"Quistes del cordón, y/o epidídimo, extirpación; epididimotomía diagnóstica y/o terapéutica (proc. aut.)",0,null,null,null,null,0,null,null,null,null,null,null,0,null,null,0,null,null,0,null,null,0,null,null,null,null,null,null,null,null,null,null,null,null,137580,0]
[1902074,"Exploración escroto agudo. Incluye hematocele por trauma, destorción y fijación testículo, hidatidectomía  y eversión bilateral si corresponde ",0,null,null,null,null,0,null,null,null,null,null,null,0,null,null,0,null,null,0,null,null,0,null,null,null,null,null,null,null,null,null,null,null,null,143100,0]
[1902075,"Varicocele unilateral y/o denervación cordón espermático (incluye quistes, hidátides e hidrocele mismo lado)",0,null,null,null,null,0,null,null,null,null,null,null,0,null,null,0,null,null,0,null,null,0,null,null,null,null,null,null,null,null,null,null,null,null,137580,0]
[1902076,"Vasectomía bilateral, (proc. aut.) (la vasectomía como tiempo previo a una resección de próstata esta incluida en la prostatectomía)",0,null,null,null,null,0,null,null,null,null,null,null,0,null,null,0,null,null,0,null,null,0,null,null,null,null,null,null,null,null,null,null,null,null,137580,0]
[1902077,"Epispadias, trat. quir.",0,null,null,null,null,0,null,null,null,null,null,null,0,null,null,0,null,null,0,null,null,0,null,null,null,null,null,null,null,null,null,null,null,null,219630,0]
[1902078,"Amputación parcial del pene (proc. aut.)",0,null,null,null,null,0,null,null,null,null,null,null,0,null,null,0,null,null,0,null,null,0,null,null,null,null,null,null,null,null,null,null,null,null,170730,0]
[1902079,"Amputación total del pene, proc. completo",0,null,null,null,null,0,null,null,null,null,null,null,0,null,null,0,null,null,0,null,null,0,null,null,null,null,null,null,null,null,null,null,null,null,279040,0]
[1902080,"Biopsia de pene (proc. aut.)",0,null,null,null,null,0,null,null,null,null,null,null,null,null,null,null,null,null,null,null,null,null,null,null,null,null,null,null,null,null,null,null,null,null,37730,0]
[1902081,"Cirugía del priapismo cualquier vía o técnica",0,null,null,null,null,0,null,null,null,null,null,null,0,null,null,0,null,null,0,null,null,0,null,null,null,null,null,null,null,null,null,null,null,null,170730,0]
[1902082,"Circuncisión (incluye sección de frenillo, y/o de sinequias bálano-prepuciales, y/o incisión dorsal c/s meatotomía)",0,null,null,null,null,0,null,null,null,null,null,null,0,null,null,0,null,null,0,null,null,0,null,null,null,null,null,null,null,null,null,null,null,null,143100,0]
[1902083,"Cirugía traumatismo peneano o curvaturas  adquiridas de la albugínea",0,null,null,null,null,0,null,null,null,null,null,null,0,null,null,0,null,null,0,null,null,0,null,null,null,null,null,null,null,null,null,null,null,null,151390,0]
[1902084,"Meatotomía hombre y/o sección frenillo y/o incisión dorsal, (proc. aut.)",0,null,null,null,null,0,null,null,null,null,null,null,null,null,null,null,null,null,null,null,null,null,null,null,null,null,null,null,null,null,null,null,null,null,28300,0]
[1902085,"Implantación prótesis peneana cualquier tipo o vía (no incluye prótesis)",0,null,null,null,null,0,null,null,null,null,null,null,0,null,null,0,null,null,0,null,null,0,null,null,null,null,null,null,null,null,null,null,null,null,281970,0]
[null,"TOTAL",{"$f":"SUM(C2115:C2197)","v":0},null,null,null,null,{"$f":"SUM(H2115:H2197)","v":0},0,0,0,0,0,0,0,0,0,0,0,0,0,0,0,0,0,0,0,0,0,0,0,0,0,0,0,0,{"$f":"SUM(AK2115:AK2197)","v":21471760},{"$f":"SUM(AL2115:AL2197)","v":0}]
[null,"GRUPO 20 : GINECOLOGIA Y OBSTETRICIA  "]
[2001001,"Amnioscopía c/s escalpe fetal",{"$f":"SUM(D2200+G2200)","v":0},{"$f":"SUM(E2200:F2200)","v":0},null,null,null,null,null,null,null,null,null,null,null,null,null,null,null,null,null,null,null,null,null,null,null,null,null,null,null,null,null,null,null,null,12970,{"$f":"AK2200*E2200","v":0}]
[2001002,"Colposcopía",0,0,null,null,null,null,null,null,null,null,null,null,null,null,null,null,null,null,null,null,null,null,null,null,null,null,null,null,null,null,null,null,null,null,6930,0]
[2001005,"Histeroscopía diagnóstica (proc. aut.)",0,0,null,null,null,null,null,null,null,null,null,null,null,null,null,null,null,null,null,null,null,null,null,null,null,null,null,null,null,null,null,null,null,null,29510,0]
[2001006,"Amniocentesis",0,0,null,null,null,null,null,null,null,null,null,null,null,null,null,null,null,null,null,null,null,null,null,null,null,null,null,null,null,null,null,null,null,null,9520,0]
[2001007,"Culdocentesis (punción del Douglas)",0,0,null,null,null,null,null,null,null,null,null,null,null,null,null,null,null,null,null,null,null,null,null,null,null,null,null,null,null,null,null,null,null,null,19860,0]
[2001008,"Hidrotubación y/o insuflación de trompas",0,0,null,null,null,null,null,null,null,null,null,null,null,null,null,null,null,null,null,null,null,null,null,null,null,null,null,null,null,null,null,null,null,null,9520,0]
[2001009,"Monitoreo basal con informe",0,0,null,null,null,null,null,null,null,null,null,null,null,null,null,null,null,null,null,null,null,null,null,null,null,null,null,null,null,null,null,null,null,null,3880,0]
[2001010,"Monitoreo fetal estresante, con control permanente del especialista y tratamiento de las posibles complicaciones",0,0,null,null,null,null,null,null,null,null,null,null,null,null,null,null,null,null,null,null,null,null,null,null,null,null,null,null,null,null,null,null,null,null,12360,0]
[2001021,"Cordocentesis",0,0,null,null,null,null,null,null,null,null,null,null,null,null,null,null,null,null,null,null,null,null,null,null,null,null,null,null,null,null,null,null,null,null,22240,0]
[2001012,"Galactografía (a.c.  04-02-005)",0,0,null,null,null,null,null,null,null,null,null,null,null,null,null,null,null,null,null,null,null,null,null,null,null,null,null,null,null,null,null,null,null,null,10040,0]
[2001013,"Histerosalpingografía (a.c. 04-02-011)",0,0,null,null,null,null,null,null,null,null,null,null,null,null,null,null,null,null,null,null,null,null,null,null,null,null,null,null,null,null,null,null,null,null,13000,0]
[2001014,"Biopsia endometrio, vulva, vagina, cuello, c/u (proc. aut.)",0,0,null,null,null,null,null,null,null,null,null,null,null,null,null,null,null,null,null,null,null,null,null,null,null,null,null,null,null,null,null,null,null,null,19680,0]
[2001015,"Colocación o extracción de dispositivo intrauterino (no incluye el valor del dispositivo)                    ",0,0,null,null,null,null,null,null,null,null,null,null,null,null,null,null,null,null,null,null,null,null,null,null,null,null,null,null,null,null,null,null,null,null,8180,0]
[2001016,"Electrodiatermo o criocoagulación de lesiones del cuello",0,0,null,null,null,null,null,null,null,null,null,null,null,null,null,null,null,null,null,null,null,null,null,null,null,null,null,null,null,null,null,null,null,null,20060,0]
[2001020,"Test postcoital",0,0,null,null,null,null,null,null,null,null,null,null,null,null,null,null,null,null,null,null,null,null,null,null,null,null,null,null,null,null,null,null,null,null,10040,0]
[2001022,"Punción evacuadora de quistes mamarios, c/s toma de muestras, c/s inyección de medicamentos",0,0,null,null,null,null,null,null,null,null,null,null,null,null,null,null,null,null,null,null,null,null,null,null,null,null,null,null,null,null,null,null,null,null,9220,0]
[2001023,"Biopsia estereotaxíca digital de mama",0,0,null,null,null,null,null,null,null,null,null,null,null,null,null,null,null,null,null,null,null,null,null,null,null,null,null,null,null,null,null,null,null,null,467610,0]
[2001024,"Biopsia Corial",0,0,null,null,null,null,null,null,null,null,null,null,null,null,null,null,null,null,null,null,null,null,null,null,null,null,null,null,null,null,null,null,null,null,null,0]
[null,"Total ARANCEL MAI",{"$f":"SUM(C2200:C2216)","v":0},{"$f":"SUM(D2200:D2216)","v":0},{"$f":"SUM(E2200:E2216)","v":0},{"$f":"SUM(F2200:F2216)","v":0},{"$f":"SUM(G2200:G2216)","v":0},null,null,null,null,null,null,null,null,null,null,null,null,null,null,null,null,null,null,null,{"$f":"SUM(AA2200:AA2216)","v":0},0,0,0,0,0,0,0,0,0,684620,0]
[2004009,"Fototerapia a recién nacidos",{"$f":"SUM(D2219+G2219)","v":0},{"$f":"SUM(E2219:F2219)","v":0}]
[5099003,"Biopsia estereotáxica de mama",0,0]
[5099004,"Biopsia core (BC) guiada por ultrasonido (US)",0,0]
[5099045,"Insercion Implante Anticonceptivo",0,0]
[5099046,"Remocion Implante Anticonceptivo",{"$f":"SUM(D2223+G2223)","v":0},{"$f":"SUM(E2223:F2223)","v":0}]
[5099047,"Insercion Pellets subcutáneo ",{"$f":"SUM(D2224+G2224)","v":0},{"$f":"SUM(E2224:F2224)","v":0}]
[null,"Electrofulguración condiloma",{"$f":"SUM(D2225+G2225)","v":0},{"$f":"SUM(E2225:F2225)","v":0}]
[null,"TOTAL ARANCEL MLE Y NO ARANCELADO",{"$f":"SUM(C2219:C2225)","v":0},{"$f":"SUM(D2220:D2225)","v":0},{"$f":"SUM(E2220:E2225)","v":0},{"$f":"SUM(F2220:F2225)","v":0},{"$f":"SUM(G2220:G2225)","v":0},null,null,null,null,null,null,null,null,null,null,null,null,null,null,null,null,null,null,null,{"$f":"SUM(AA2220:AA2225)","v":0},0,0,0,0,0,0,0,0,0]
[null,"TOTAL PRODUCCION",{"$f":"SUM(C2218+C2226)","v":0},{"$f":"SUM(D2218+D2226)","v":0},{"$f":"SUM(E2218+E2226)","v":0},{"$f":"SUM(F2218+F2226)","v":0},{"$f":"SUM(G2218+G2226)","v":0},null,null,null,null,null,null,null,null,null,null,null,null,null,null,null,null,null,null,null,{"$f":"SUM(AA2218+AA2226)","v":0},0,0,0,0,0,0,0,0,0,684620,0]
[null,"CIRUGIA DE LA MAMA (UN LADO)  "]
[2002001,"Absceso y/o hematoma, trat. quir.",{"$f":"SUM(I2229:N2229)","v":0},null,null,null,null,{"$f":"+I2229+J2229","v":0},null,null,null,null,null,null,null,null,null,null,null,null,null,null,null,null,null,null,null,null,null,null,null,null,null,null,null,null,33860,{"$f":"AK2229*I2229","v":0}]
[2002002,"Mastectomía parcial (cuadrantectomía o similar) o total s/vaciamiento ganglionar",{"$f":"SUM(I2230:N2230)","v":0},null,null,null,null,0,null,null,null,null,null,null,{"$f":"SUM(P2230:Q2230)","v":0},null,null,{"$f":"SUM(S2230:T2230)","v":0},null,null,{"$f":"SUM(V2230:W2230)","v":0},null,null,{"$f":"SUM(Y2230:Z2230)","v":0},null,null,null,null,null,null,null,null,null,null,null,null,196280,{"$f":"AK2230*I2230","v":0}]
[2002003,"Mastectomía radical o tumorectomía c/vaciamiento ganglionar o mastectomía total c/vaciamiento ganglionar",{"$f":"SUM(I2231:N2231)","v":0},null,null,null,null,0,null,null,null,null,null,null,{"$f":"SUM(P2231:Q2231)","v":0},null,null,{"$f":"SUM(S2231:T2231)","v":0},null,null,{"$f":"SUM(V2231:W2231)","v":0},null,null,{"$f":"SUM(Y2231:Z2231)","v":0},null,null,null,null,null,null,null,null,null,null,null,null,354700,{"$f":"AK2231*I2231","v":0}]
[2002005,"Tumor benigno y/o quiste y/o mama supernumeraria y/o aberrante o politelia, o biopsia quirúrgica extemporánea, trat. quir. (proc. aut)",{"$f":"SUM(I2232:N2232)","v":0},null,null,null,null,0,null,null,null,null,null,null,{"$f":"SUM(P2232:Q2232)","v":0},null,null,{"$f":"SUM(S2232:T2232)","v":0},null,null,{"$f":"SUM(V2232:W2232)","v":0},null,null,{"$f":"SUM(Y2232:Z2232)","v":0},null,null,null,null,null,null,null,null,null,null,null,null,137580,{"$f":"AK2232*I2232","v":0}]
[null,"TOTAL",{"$f":"SUM(C2229:C2232)","v":0},null,null,null,null,{"$f":"SUM(H2229:H2232)","v":0},0,0,0,0,0,0,0,0,0,0,0,0,0,0,0,0,0,0,0,0,0,0,0,0,0,0,0,0,722420,0]
[null,"CIRUGIA GINECOLOGICA                                  "]
[2003031,"Videolaparoscopía ginecológica exploradora (incluye toma de muestras para biopsias, punción de quistes y liberación de adherencias) (proc. aut.)",{"$f":"SUM(I2235:N2235)","v":0},null,null,null,null,{"$f":"+I2235+J2235","v":0},null,null,null,null,null,null,{"$f":"SUM(P2235:Q2235)","v":0},null,null,{"$f":"SUM(S2235:T2235)","v":0},null,null,{"$f":"SUM(V2235:W2235)","v":0},null,null,{"$f":"SUM(Y2235:Z2235)","v":0},null,null,null,null,null,null,null,null,null,null,null,null,146140,{"$f":"AK2235*I2235","v":0}]
[2003001,"Ooforectomía parcial o total, uni o bilateral (proc. aut.)",{"$f":"SUM(I2236:N2236)","v":0},null,null,null,null,0,null,null,null,null,null,null,{"$f":"SUM(P2236:Q2236)","v":0},null,null,{"$f":"SUM(S2236:T2236)","v":0},null,null,{"$f":"SUM(V2236:W2236)","v":0},null,null,{"$f":"SUM(Y2236:Z2236)","v":0},null,null,null,null,null,null,null,null,null,null,null,null,165690,0]
[2003002,"Anexectomía y/o vac. de absceso tubo-ovárico, uni o bilateral.",{"$f":"SUM(I2237:N2237)","v":0},null,null,null,null,0,null,null,null,null,null,null,{"$f":"SUM(P2237:Q2237)","v":0},null,null,{"$f":"SUM(S2237:T2237)","v":0},null,null,{"$f":"SUM(V2237:W2237)","v":0},null,null,{"$f":"SUM(Y2237:Z2237)","v":0},null,null,null,null,null,null,null,null,null,null,null,null,198850,0]
[2003003,"Embarazo tubario, trat. quir.",0,null,null,null,null,0,null,null,null,null,null,null,0,null,null,{"$f":"SUM(S2238:T2238)","v":0},null,null,{"$f":"SUM(V2238:W2238)","v":0},null,null,{"$f":"SUM(Y2238:Z2238)","v":0},null,null,null,null,null,null,null,null,null,null,null,null,201910,0]
[2003004,"Ligadura o sección uni o bilateral de las trompas (Madlener, Pomeroy, o similares) (proc. aut.)",0,null,null,null,null,0,null,null,null,null,null,null,0,null,null,{"$f":"SUM(S2239:T2239)","v":0},null,null,{"$f":"SUM(V2239:W2239)","v":0},null,null,{"$f":"SUM(Y2239:Z2239)","v":0},null,null,null,null,null,null,null,null,null,null,null,null,159020,0]
[2003005,"Salpingectomía uni o bilateral",0,null,null,null,null,0,null,null,null,null,null,null,0,null,null,0,null,null,{"$f":"SUM(V2240:W2240)","v":0},null,null,0,null,null,null,null,null,null,null,null,null,null,null,null,159020,0]
[2003006,"Esterilidad tubaria, operación plástica, uni o bilateral- Con microcirugía",0,null,null,null,null,0,null,null,null,null,null,null,0,null,null,0,null,null,0,null,null,0,null,null,null,null,null,null,null,null,null,null,null,null,342100,0]
[2003007,"Esterilidad tubaria, operación plástica, uni o bilateral- Sin microcirugía",0,null,null,null,null,0,null,null,null,null,null,null,0,null,null,0,null,null,0,null,null,0,null,null,null,null,null,null,null,null,null,null,null,null,232280,0]
[2003008,"Miomectomía",0,null,null,null,null,0,null,null,null,null,null,null,0,null,null,0,null,null,0,null,null,0,null,null,null,null,null,null,null,null,null,null,null,null,196910,0]
[2003041,"Extracción de DIU incrustado, por vía abdominal",0,null,null,null,null,0,null,null,null,null,null,null,0,null,null,0,null,null,0,null,null,0,null,null,null,null,null,null,null,null,null,null,null,null,196910,0]
[2003009,"Histerectomía por vía abdominal, c/s anexectomía uni o bilat.- Sub-total",0,null,null,null,null,0,null,null,null,null,null,null,0,null,null,0,null,null,0,null,null,0,null,null,null,null,null,null,null,null,null,null,null,null,233820,0]
[2003010,"Histerectomía por vía abdominal, c/s anexectomía uni o bilat.- Total o ampliada",0,null,null,null,null,0,null,null,null,null,null,null,0,null,null,0,null,null,0,null,null,0,null,null,null,null,null,null,null,null,null,null,null,null,419360,0]
[2003011,"Ligamento ancho: abscesos y/o hematomas y/o flegmones y/o quistomas y/o várices u otros, trat. quir. (proc. aut.)",0,null,null,null,null,0,null,null,null,null,null,null,0,null,null,0,null,null,0,null,null,0,null,null,null,null,null,null,null,null,null,null,null,null,227100,0]
[2003012,"Conización y/o amputación del cuello, diagnostica y/o terapéutica  c/s biopsia",0,null,null,null,null,0,null,null,null,null,null,null,0,null,null,0,null,null,0,null,null,0,null,null,null,null,null,null,null,null,null,null,null,null,137580,0]
[2003013,"Exanteración pelviana anterior y/o posterior",0,null,null,null,null,0,null,null,null,null,null,null,0,null,null,0,null,null,0,null,null,0,null,null,null,null,null,null,null,null,null,null,null,null,736570,0]
[2003014,"Histerectomía por vía vaginal",0,null,null,null,null,0,null,null,null,null,null,null,0,null,null,0,null,null,0,null,null,0,null,null,null,null,null,null,null,null,null,null,null,null,351780,0]
[2003015,"Histerectomía radical con disección pelviana completa de territorios ganglionares, incluye ganglios lumboaórticos (operación de Wertheim o similares)",0,null,null,null,null,0,null,null,null,null,null,null,0,null,null,0,null,null,0,null,null,0,null,null,null,null,null,null,null,null,null,null,null,null,572520,0]
[2003016,"Histerectomía total c/intervención incontinencia urinaria, cualquier técnica",0,null,null,null,null,0,null,null,null,null,null,null,0,null,null,0,null,null,0,null,null,0,null,null,null,null,null,null,null,null,null,null,null,null,450520,0]
[2003017,"Histeropexia",0,null,null,null,null,0,null,null,null,null,null,null,0,null,null,0,null,null,0,null,null,0,null,null,null,null,null,null,null,null,null,null,null,null,182430,0]
[2003018,"Plastía uterina (operación de Strassmar o similares)",0,null,null,null,null,0,null,null,null,null,null,null,0,null,null,0,null,null,0,null,null,0,null,null,null,null,null,null,null,null,null,null,null,null,221900,0]
[2003019,"Polipectomía (uno o más) (proc. aut.)",0,null,null,null,null,0,null,null,null,null,null,null,null,null,null,null,null,null,null,null,null,null,null,null,null,null,null,null,null,null,null,null,null,null,42880,0]
[2003020,"Sinequia y/o estenosis cervical, trat. quir.",0,null,null,null,null,0,null,null,null,null,null,null,0,null,null,0,null,null,0,null,null,0,null,null,null,null,null,null,null,null,null,null,null,null,73370,0]
[2003030,"Desgarro cervical trat. quir.",0,null,null,null,null,0,null,null,null,null,null,null,0,null,null,0,null,null,0,null,null,0,null,null,null,null,null,null,null,null,null,null,null,null,137580,0]
[2003040,"Incompetencia cervical trat. quir.",0,null,null,null,null,0,null,null,null,null,null,null,0,null,null,0,null,null,0,null,null,0,null,null,null,null,null,null,null,null,null,null,null,null,118890,0]
[2003021,"Colpoceliotomía",0,null,null,null,null,0,null,null,null,null,null,null,0,null,null,0,null,null,0,null,null,0,null,null,null,null,null,null,null,null,null,null,null,null,73370,0]
[2003022,"Incontinencia urinaria de esfuerzo, trat. quir. por vía vaginal (proc. aut.)",0,null,null,null,null,0,null,null,null,null,null,null,0,null,null,0,null,null,0,null,null,0,null,null,null,null,null,null,null,null,null,null,null,null,170730,0]
[2003023,"Prolapso anterior y/o posterior con repar., incontinencia urinaria por vía extravaginal o combinada",0,null,null,null,null,0,null,null,null,null,null,null,0,null,null,0,null,null,0,null,null,0,null,null,null,null,null,null,null,null,null,null,null,null,279040,0]
[2003024,"Prolapso anterior y/o posterior c/s trat. de incontinencia urinaria por vía vaginal, trat. quir.",0,null,null,null,null,0,null,null,null,null,null,null,0,null,null,0,null,null,0,null,null,0,null,null,null,null,null,null,null,null,null,null,null,null,183230,0]
[2003025,"Quiste y/o desgarro y/o tabique vaginal, trat. quir.",0,null,null,null,null,0,null,null,null,null,null,null,0,null,null,0,null,null,0,null,null,0,null,null,null,null,null,null,null,null,null,null,null,null,73370,0]
[2003026,"Bartolinitis, vaciamiento y drenaje (proc. aut.)",0,null,null,null,null,0,null,null,null,null,null,null,null,null,null,null,null,null,null,null,null,null,null,null,null,null,null,null,null,null,null,null,null,null,35110,0]
[2003027,"Bartolinocistoneostomía o extirp. de la glándula",0,null,null,null,null,0,null,null,null,null,null,null,0,null,null,0,null,null,0,null,null,0,null,null,null,null,null,null,null,null,null,null,null,null,137580,0]
[2003028,"Vulvectomía- Radical",0,null,null,null,null,0,null,null,null,null,null,null,0,null,null,0,null,null,0,null,null,0,null,null,null,null,null,null,null,null,null,null,null,null,419400,0]
[2003029,"Vulvectomía- Simple",0,null,null,null,null,0,null,null,null,null,null,null,0,null,null,0,null,null,0,null,null,0,null,null,null,null,null,null,null,null,null,null,null,null,238270,0]
[null,"TOTAL",{"$f":"SUM(C2235:C2267)","v":0},null,null,null,null,{"$f":"SUM(H2235:H2267)","v":0},{"$f":"SUM(I2235:I2267)","v":0},0,0,0,0,0,0,0,0,0,0,0,{"$f":"SUM(U2235:U2267)","v":0},0,0,0,0,0,0,0,0,0,0,0,0,0,0,0,7515230,0]
[null,"CIRUGIA  OBSTETRICA Y PARTOS                         "]
[2004001,"Aborto retenido, vaciamiento de (incluye la inducción en los casos que corresponda)",{"$f":"SUM(D2270+G2270)","v":0},{"$f":"SUM(E2270:F2270)","v":0},null,null,null,null,null,null,null,null,null,null,null,null,null,null,null,null,null,null,null,null,null,null,null,null,null,null,null,null,null,null,null,null,111780,{"$f":"AK2270*E2270","v":0}]
[2004002,"Raspado uterino diagnóstico o terapéutico por metrorragia o por restos de aborto",{"$f":"SUM(D2271+G2271)","v":0},{"$f":"SUM(E2271:F2271)","v":0},null,null,null,null,null,null,null,null,null,null,null,null,null,null,null,null,null,null,null,null,null,null,null,null,null,null,null,null,null,null,null,null,107330,{"$f":"AK2271*E2271","v":0}]
[2004007,"Aspiración manual endouterina",{"$f":"SUM(D2272+G2272)","v":0},{"$f":"SUM(E2272:F2272)","v":0},null,null,null,null,null,null,null,null,null,null,null,null,null,null,null,null,null,null,null,null,null,null,null,null,null,null,null,null,null,null,null,null,null,{"$f":"AK2272*E2272","v":0}]
[2004008,"Tratamiento Farmacológico Ley IVE (incluye Consulta especialidad en Obstetricia y Ginecología y Fármacos)",0,0,null,null,null,null,null,null,null,null,null,null,null,null,null,null,null,null,null,null,null,null,null,null,null,null,null,null,null,null,null,null,null,null,null,{"$f":"AK2273*E2273","v":0}]
[2004006,"Cesárea c/s salpingoligadura o salpingectomía",{"$f":"SUM(I2274:N2274)","v":6},null,null,null,null,{"$f":"SUM(I2274+J2274)","v":4},2,2,2,null,null,null,{"$f":"SUM(P2274:Q2274)","v":0},null,null,{"$f":"SUM(S2274:T2274)","v":0},null,null,{"$f":"SUM(V2274:W2274)","v":0},null,null,{"$f":"SUM(Y2274:Z2274)","v":0},null,null,null,null,null,null,null,null,null,null,null,null,142010,{"$f":"AK2274*I2274","v":284020}]
[2004005,"Cesárea con histerectomía",{"$f":"SUM(I2275:N2275)","v":4},null,null,null,null,{"$f":"SUM(I2275+J2275)","v":2},2,null,2,null,null,null,{"$f":"SUM(P2275:Q2275)","v":0},null,null,{"$f":"SUM(S2275:T2275)","v":0},null,null,{"$f":"SUM(V2275:W2275)","v":0},null,null,{"$f":"SUM(Y2275:Z2275)","v":0},null,null,null,null,null,null,null,null,null,null,null,null,279040,{"$f":"AK2275*I2275","v":558080}]
[2004013,"Cesárea                              ",4,null,null,null,null,4,2,2,null,null,null,null,0,null,null,0,null,null,0,null,null,0,null,null,null,null,null,null,null,null,null,null,null,null,145690,{"$f":"AK2276*I2276","v":291380}]
[2004103,"Parto normal",{"$f":"SUM(D2277+G2277)","v":4},{"$f":"SUM(E2277:F2277)","v":4},2,2,null,null,null,null,null,null,null,null,null,null,null,null,null,null,null,null,null,null,null,null,null,null,null,null,null,null,null,null,null,null,142000,{"$f":"AK2277*E2277","v":284000}]
[2004113,"Parto distósico vaginal",{"$f":"SUM(D2278+G2278)","v":4},{"$f":"SUM(E2278:F2278)","v":4},2,2,null,null,null,null,null,null,null,null,null,null,null,null,null,null,null,null,null,null,null,null,null,null,null,null,null,null,null,null,null,null,149400,{"$f":"AK2278*E2278","v":298800}]
[null,"TOTAL ARANCEL MAI",{"$f":"SUM(C2270:C2278)","v":22},8,4,4,0,10,6,{"$f":"SUM(J2270:J2278)","v":4},4,0,0,0,0,0,0,0,0,0,0,0,0,0,0,0,{"$f":"SUM(AA2270:AA2278)","v":0},0,0,0,0,0,0,0,0,0,1077250,1716280]
[null,"CIRUGIA Y PROCEDIMIENTOS OBSTETRICOS"]
[2004003,"Parto presentación cefálica o podálica, c/s episiotomía, c/s sutura, c/s fórceps, c/s inducción, c/s versión interna, c/s revisión, c/s extracción manual de placenta, c/s monitorización. (Unico o Múltiple)",{"$f":"SUM(D2281+G2281)","v":6},{"$f":"SUM(E2281:F2281)","v":4},2,2,2]
[null,"TOTAL ARANCEL MLE Y NO ARANCELADO",{"$f":"SUM(C2281:C2281)","v":6},{"$f":"SUM(D2281:D2281)","v":4},{"$f":"SUM(E2281:E2281)","v":2},{"$f":"SUM(F2281:F2281)","v":2},{"$f":"SUM(G2281:G2281)","v":2},null,null,null,null,null,null,null,null,null,null,null,null,null,null,null,null,null,null,null,{"$f":"SUM(AA2281:AA2281)","v":0},0,0,0,0,0,0,0,0,0]
[null,"TOTAL PRODUCCION",{"$f":"SUM(C2279+C2282)","v":28},{"$f":"SUM(D2279+D2282)","v":12},6,6,2,null,null,null,null,null,null,null,null,null,null,null,null,null,null,null,null,null,null,null,{"$f":"SUM(AA2279+AA2282)","v":0},{"$f":"SUM(AB2279+AB2282)","v":0},{"$f":"SUM(AC2279+AC2282)","v":0},{"$f":"SUM(AD2279+AD2282)","v":0},{"$f":"SUM(AE2279+AE2282)","v":0},{"$f":"SUM(AF2279+AF2282)","v":0},{"$f":"SUM(AG2279+AG2282)","v":0},{"$f":"SUM(AH2279+AH2282)","v":0},{"$f":"SUM(AI2279+AI2282)","v":0},{"$f":"SUM(AJ2279+AJ2282)","v":0}]
["GRUPO 21 :  PROCEDIMIENTOS DE TRAUMATOLOGÍA  "]
[2101001,"Infiltracion local medicamentos (bursas, tendones, yuxtaarticulares y/o intraarticulares",{"$f":"SUM(D2285+G2285)","v":0},{"$f":"SUM(E2285:F2285)","v":0}]
[2101002,"Procedimiento para exploraciones radiologicas (incluye maniobra e inyeccion del medio de contraste)  BM18A  Revisar en BM Colocación valva",0,0]
[2101003,"Movilizacion articular bajo anestesia general.",0,0]
[2105001,"Calzon corto de yeso",0,0]
[2105002,"Corbata tipo schantz",0,0]
[2105003,"Minerva de yeso",0,0]
[2105004,"Rodillera, bota larga o corta de yeso",0,0]
[2105005,"Velpeau",0,0]
[2105006,"Yeso antebraquial c/s ferula digital",0,0]
[2105007,"Yeso braquicarpiano",0,0]
[2105008,"Yeso pelvipedio bilateral",0,0]
[2105009,"Yeso pelvipedio unilateral",0,0]
[2105010,"Yeso toracobraquial",0,0]
[2105011,"Corsets de milwaukee o similares (incluye la toma de molde )",0,0]
[2105012,"Corsets de risser o similares",0,0]
[2105013,"Corsets de yeso simple (tipo watson jones)",0,0]
[5099114,"Infiltración intraarticular",{"$f":"SUM(D2301+G2301)","v":0},{"$f":"SUM(E2301:F2301)","v":0}]
[null,"TOTAL",{"$f":"SUM(C2285:C2301)","v":0},0,0,0,0,null,null,null,null,null,null,null,null,null,null,null,null,null,null,null,null,null,null,null,0,0,0,0,0,0,0,0,0,0]
[null,"CIRUGÍA TRAUMATOLÓGICA            "]
[2104001,"Artroscopía diagnóstica c/s biopsia, c/s sección de bridas, extracción de cuerpo extraño",{"$f":"SUM(I2304:N2304)","v":0},null,null,null,null,{"$f":"+I2304+J2304","v":0},null,null,null,null,null,null,null,null,null,null,null,null,null,null,null,null,null,null,null,null,null,null,null,null,null,null,null,null,144020,{"$f":"AK2304*I2304","v":0}]
[2104002,"Exostosis u osteocondroma, trat. quir.",{"$f":"SUM(I2305:N2305)","v":0},null,null,null,null,0,null,null,null,null,null,null,null,null,null,null,null,null,null,null,null,null,null,null,null,null,null,null,null,null,null,null,null,null,143160,0]
[2104003,"Quistes sinoviales de vainas flexoras, bursas",{"$f":"SUM(I2306:N2306)","v":0},null,null,null,null,0,null,null,null,null,null,null,null,null,null,null,null,null,null,null,null,null,null,null,null,null,null,null,null,null,null,null,null,null,117310,0]
[2104004,"Tracción halocraneana o estribo-craneana (proc. aut.)",0,null,null,null,null,0,null,null,null,null,null,null,null,null,null,null,null,null,null,null,null,null,null,null,null,null,null,null,null,null,null,null,null,null,37180,0]
[2104005,"Tracción halocráneo-femoral",0,null,null,null,null,0,null,null,null,null,null,null,null,null,null,null,null,null,null,null,null,null,null,null,null,null,null,null,null,null,null,null,null,null,117310,0]
[2104006,"Tracción transesquelética o de partes blandas en adultos o en niños (proc. aut.)",0,null,null,null,null,0,null,null,null,null,null,null,null,null,null,null,null,null,null,null,null,null,null,null,null,null,null,null,null,null,null,null,null,null,24820,0]
[2104007,"Artrodesis codo o muñeca, c/u",0,null,null,null,null,0,null,null,null,null,null,null,null,null,null,null,null,null,null,null,null,null,null,null,null,null,null,null,null,null,null,null,null,null,151570,0]
[2104008,"Artrodesis hombro, cadera, rodilla, tobillo o sacroilíaca, c/u",0,null,null,null,null,0,null,null,null,null,null,null,{"$f":"SUM(P2311:Q2311)","v":0},null,null,{"$f":"SUM(S2311:T2311)","v":0},null,null,{"$f":"SUM(V2311:W2311)","v":0},null,null,{"$f":"SUM(Y2311:Z2311)","v":0},null,null,null,null,null,null,null,null,null,null,null,null,215340,0]
[2104009,"Artrodesis mano o pie c/u",0,null,null,null,null,0,null,null,null,null,null,null,null,null,null,null,null,null,null,null,null,null,null,null,null,null,null,null,null,null,null,null,null,null,151570,0]
[2104010,"Artrodesis brazo, antebrazo,  muslo y pierna, c/u",0,null,null,null,null,0,null,null,null,null,null,null,0,null,null,{"$f":"SUM(S2313:T2313)","v":0},null,null,0,null,null,{"$f":"SUM(Y2313:Z2313)","v":0},null,null,null,null,null,null,null,null,null,null,null,null,236030,0]
[2104011,"Artrodesis de mano o pie, c/u",0,null,null,null,null,0,null,null,null,null,null,null,0,null,null,0,null,null,0,null,null,0,null,null,null,null,null,null,null,null,null,null,null,null,161090,0]
[2104012,"Osteítis, raspado, c/s secuestrectomía",0,null,null,null,null,0,null,null,null,null,null,null,0,null,null,0,null,null,0,null,null,0,null,null,null,null,null,null,null,null,null,null,null,null,161060,0]
[2104013,"Osteomielitis aguda hematógena, drenaje quirúrgico, c/s dispositivos de osteoclisis",0,null,null,null,null,0,null,null,null,null,null,null,0,null,null,0,null,null,0,null,null,0,null,null,null,null,null,null,null,null,null,null,null,null,172950,0]
[2104014,"Osteomielitis crónica huesos largos, legrado óseo,  c/s osteosíntesis o aparato de yeso",0,null,null,null,null,0,null,null,null,null,null,null,0,null,null,0,null,null,0,null,null,0,null,null,null,null,null,null,null,null,null,null,null,null,172950,0]
[2104015,"Artrotomía hombro o cadera c/u",0,null,null,null,null,0,null,null,null,null,null,null,0,null,null,0,null,null,0,null,null,0,null,null,null,null,null,null,null,null,null,null,null,null,172950,0]
[2104016,"Artrotomia de codo, muñeca, tobillo o temporomandibular, c/u",0,null,null,null,null,0,null,null,null,null,null,null,0,null,null,0,null,null,0,null,null,0,null,null,null,null,null,null,null,null,null,null,null,null,161060,0]
[2104017,"Pseudoartrosis  infectada huesos largos, trat. quir. cualquier técnica, c/s dispositivo de osteoclisis, c/s osteosíntesis o aparato de yeso",0,null,null,null,null,0,null,null,null,null,null,null,0,null,null,0,null,null,0,null,null,0,null,null,null,null,null,null,null,null,null,null,null,null,227170,0]
[2104018,"Autotrasplante óseo microquirúrgico",0,null,null,null,null,0,null,null,null,null,null,null,0,null,null,0,null,null,0,null,null,0,null,null,null,null,null,null,null,null,null,null,null,null,576690,0]
[2104019,"Injerto esponjoso metafisiario",0,null,null,null,null,0,null,null,null,null,null,null,null,null,null,null,null,null,null,null,null,null,null,null,null,null,null,null,null,null,null,null,null,null,151570,0]
[2104020,"Injertos esponjosos o córtico-esponjosos de cresta ilíaca",0,null,null,null,null,0,null,null,null,null,null,null,null,null,null,null,null,null,null,null,null,null,null,null,null,null,null,null,null,null,null,null,null,null,151570,0]
[2104021,"Trasplante óseo (auto u homotrasplante)",0,null,null,null,null,0,null,null,null,null,null,null,0,null,null,0,null,null,0,null,null,0,null,null,null,null,null,null,null,null,null,null,null,null,341630,0]
[2104022,"Lesiones quísticas con fractura patológica: legrado óseo, c/s relleno injerto esponjoso, c/s osteosíntesis y/o aparato de inmovilización postoperatoria",0,null,null,null,null,0,null,null,null,null,null,null,0,null,null,0,null,null,0,null,null,0,null,null,null,null,null,null,null,null,null,null,null,null,243750,0]
[2104023,"Lesiones quísticas intraosea: legrado óseo, c/s relleno de injertos",0,null,null,null,null,0,null,null,null,null,null,null,0,null,null,0,null,null,0,null,null,0,null,null,null,null,null,null,null,null,null,null,null,null,189440,0]
[2104024,"Metástasis ósea c/s fractura patológica, legrado tumoral, relleno cemento quirúrgico y osteosíntesis",0,null,null,null,null,0,null,null,null,null,null,null,0,null,null,0,null,null,0,null,null,0,null,null,null,null,null,null,null,null,null,null,null,null,243750,0]
[2104025,"Tumor óseo, resección en bloque, c/s osteosíntesis y/o aparato inmovilización postoperatorio",0,null,null,null,null,0,null,null,null,null,null,null,0,null,null,0,null,null,0,null,null,0,null,null,null,null,null,null,null,null,null,null,null,null,243750,0]
[2104026,"Tumores o quistes o lesiones pseudoquísticas o musculares y/o tendíneas, trat. quir.-TMP",0,null,null,null,null,0,null,null,null,null,null,null,0,null,null,0,null,null,0,null,null,0,null,null,null,null,null,null,null,null,null,null,null,null,195710,0]
[2104027,"Tumores óseos: resección en bloque, epifisiaria c/artrodesis o diafisiaria-TMP",0,null,null,null,null,0,null,null,null,null,null,null,0,null,null,0,null,null,0,null,null,0,null,null,null,null,null,null,null,null,null,null,null,null,264520,0]
[2104028,"Tumores primarios o metastásicos vertebrales: corporectomía, reemplazo por cemento quir. o injerto óseo, c/s osteosíntesis-TMP",0,null,null,null,null,0,null,null,null,null,null,null,0,null,null,0,null,null,0,null,null,0,null,null,null,null,null,null,null,null,null,null,null,null,636060,0]
[2104029,"Codo o muñeca o metacarpofalángicas, c/u",0,null,null,null,null,0,null,null,null,null,null,null,0,null,null,0,null,null,0,null,null,0,null,null,null,null,null,null,null,null,null,null,null,null,135180,0]
[2104030,"Rodilla o cadera u hombro, c/u-TMP",0,null,null,null,null,0,null,null,null,null,null,null,0,null,null,0,null,null,0,null,null,0,null,null,null,null,null,null,null,null,null,null,null,null,172940,0]
[2104031,"Epineurorrafia microquirúrgica con magnificación cualquier tronco nervioso (con excepción nervios digitales)",0,null,null,null,null,0,null,null,null,null,null,null,0,null,null,0,null,null,0,null,null,0,null,null,null,null,null,null,null,null,null,null,null,null,298760,0]
[2104033,"Biopsia ósea por punción",0,null,null,null,null,0,null,null,null,null,null,null,null,null,null,null,null,null,null,null,null,null,null,null,null,null,null,null,null,null,null,null,null,null,31860,0]
[2104034,"Biopsia ósea quirúrgica",0,null,null,null,null,0,null,null,null,null,null,null,0,null,null,0,null,null,0,null,null,0,null,null,null,null,null,null,null,null,null,null,null,null,135180,0]
[2104035,"Biopsia sinovial o muscular por punción",0,null,null,null,null,0,null,null,null,null,null,null,null,null,null,null,null,null,null,null,null,null,null,null,null,null,null,null,null,null,null,null,null,null,30150,0]
[2104036,"Biopsia sinovial o muscular quirúrgica",0,null,null,null,null,0,null,null,null,null,null,null,null,null,null,null,null,null,null,null,null,null,null,null,null,null,null,null,null,null,null,null,null,null,45680,0]
[2104037,"Biopsia vertebral por punción",0,null,null,null,null,0,null,null,null,null,null,null,null,null,null,null,null,null,null,null,null,null,null,null,null,null,null,null,null,null,null,null,null,null,61650,0]
[2104038,"Muñón de amputación, regularización de",0,null,null,null,null,0,null,null,null,null,null,null,null,null,null,null,null,null,null,null,null,null,null,null,null,null,null,null,null,null,null,null,null,null,151570,0]
[2104039,"Osteocondrosis o epifisitis, trat. quir.",0,null,null,null,null,0,null,null,null,null,null,null,0,null,null,0,null,null,0,null,null,0,null,null,null,null,null,null,null,null,null,null,null,null,161060,0]
[2104040,"Amputación interescápulo-torácica",0,null,null,null,null,0,null,null,null,null,null,null,0,null,null,0,null,null,0,null,null,0,null,null,null,null,null,null,null,null,null,null,null,null,458000,0]
[2104041,"Desarticulación escápulo-humeral",0,null,null,null,null,0,null,null,null,null,null,null,0,null,null,0,null,null,0,null,null,0,null,null,null,null,null,null,null,null,null,null,null,null,319190,0]
[2104042,"Endoprótesis total, cualquier técnica",0,null,null,null,null,0,null,null,null,null,null,null,0,null,null,0,null,null,0,null,null,0,null,null,null,null,null,null,null,null,null,null,null,null,328100,0]
[2104043,"Fijación de escápula",0,null,null,null,null,0,null,null,null,null,null,null,0,null,null,0,null,null,0,null,null,0,null,null,null,null,null,null,null,null,null,null,null,null,243750,0]
[2104044,"Fractura cuello humeral, trat. quir.",0,null,null,null,null,0,null,null,null,null,null,null,0,null,null,0,null,null,0,null,null,0,null,null,null,null,null,null,null,null,null,null,null,null,243750,0]
[2104045,"Fractura de clavícula, osteosíntesis",0,null,null,null,null,0,null,null,null,null,null,null,0,null,null,0,null,null,0,null,null,0,null,null,null,null,null,null,null,null,null,null,null,null,135230,0]
[2104046,"Fractura escápula, osteosíntesis",0,null,null,null,null,0,null,null,null,null,null,null,0,null,null,0,null,null,0,null,null,0,null,null,null,null,null,null,null,null,null,null,null,null,172940,0]
[2104047,"Luxación acromio-clavicular o esterno-clavicular, reducción o plastía cápsuloligamentosa y osteosíntesis",0,null,null,null,null,0,null,null,null,null,null,null,0,null,null,0,null,null,0,null,null,0,null,null,null,null,null,null,null,null,null,null,null,null,189440,0]
[2104048,"Luxación recidivante, trat. quir.",0,null,null,null,null,0,null,null,null,null,null,null,0,null,null,0,null,null,0,null,null,0,null,null,null,null,null,null,null,null,null,null,null,null,227170,0]
[2104049,"Luxación traumática, reducción cruenta",0,null,null,null,null,0,null,null,null,null,null,null,0,null,null,0,null,null,0,null,null,0,null,null,null,null,null,null,null,null,null,null,null,null,161060,0]
[2104050,"Luxofractura, reducción y osteosíntesis",0,null,null,null,null,0,null,null,null,null,null,null,0,null,null,0,null,null,0,null,null,0,null,null,null,null,null,null,null,null,null,null,null,null,243750,0]
[2104051,"Ruptura manguito rotadores, trat. quir. c/s acromiectomía",0,null,null,null,null,0,null,null,null,null,null,null,0,null,null,0,null,null,0,null,null,0,null,null,null,null,null,null,null,null,null,null,null,null,243750,0]
[2104052,"Transposiciones musculares",0,null,null,null,null,0,null,null,null,null,null,null,0,null,null,0,null,null,0,null,null,0,null,null,null,null,null,null,null,null,null,null,null,null,172940,0]
[2104053,"Amputación brazo",0,null,null,null,null,0,null,null,null,null,null,null,0,null,null,0,null,null,0,null,null,0,null,null,null,null,null,null,null,null,null,null,null,null,195710,0]
[2104054,"Fractura supracondílea niño; tracción esquelética, c/s osteosíntesis y aparato de yeso",0,null,null,null,null,0,null,null,null,null,null,null,0,null,null,0,null,null,0,null,null,0,null,null,null,null,null,null,null,null,null,null,null,null,179120,0]
[2104055,"Osteosíntesis diafisiaria (cualquier técnica)",0,null,null,null,null,0,null,null,null,null,null,null,0,null,null,0,null,null,0,null,null,0,null,null,null,null,null,null,null,null,null,null,null,null,172940,0]
[2104056,"Osteosíntesis supra o intercondílea (cualquier técnica)",0,null,null,null,null,0,null,null,null,null,null,null,0,null,null,0,null,null,0,null,null,0,null,null,null,null,null,null,null,null,null,null,null,null,179120,0]
[2104057,"Osteotomía (cualquier técnica)",0,null,null,null,null,0,null,null,null,null,null,null,0,null,null,0,null,null,0,null,null,0,null,null,null,null,null,null,null,null,null,null,null,null,172940,0]
[2104058,"Pseudoartrosis c/s osteosíntesis c/s yeso",0,null,null,null,null,0,null,null,null,null,null,null,0,null,null,0,null,null,0,null,null,0,null,null,null,null,null,null,null,null,null,null,null,null,172940,0]
[2104059,"Artroplastía con fascia",0,null,null,null,null,0,null,null,null,null,null,null,0,null,null,0,null,null,0,null,null,0,null,null,null,null,null,null,null,null,null,null,null,null,195700,0]
[2104060,"Cúpula radial, resección",0,null,null,null,null,0,null,null,null,null,null,null,0,null,null,0,null,null,0,null,null,0,null,null,null,null,null,null,null,null,null,null,null,null,172890,0]
[2104061,"Cúpula radial, (resección con implante de prótesis) artroplastia ",0,null,null,null,null,0,null,null,null,null,null,null,0,null,null,0,null,null,0,null,null,0,null,null,null,null,null,null,null,null,null,null,null,null,189440,0]
[2104062,"Endoprótesis total (cualquier técnica)",0,null,null,null,null,0,null,null,null,null,null,null,0,null,null,0,null,null,0,null,null,0,null,null,null,null,null,null,null,null,null,null,null,null,328100,0]
[2104063,"Epicondilitis, trat. quir. (cualquier técnica)",0,null,null,null,null,0,null,null,null,null,null,null,0,null,null,0,null,null,0,null,null,0,null,null,null,null,null,null,null,null,null,null,null,null,179110,0]
[2104064,"Luxación, reducción cruenta",0,null,null,null,null,0,null,null,null,null,null,null,0,null,null,0,null,null,0,null,null,0,null,null,null,null,null,null,null,null,null,null,null,null,161090,0]
[2104065,"Luxofractura, reducción cruenta c/s resección cúpula radial",0,null,null,null,null,0,null,null,null,null,null,null,0,null,null,0,null,null,0,null,null,0,null,null,null,null,null,null,null,null,null,null,null,null,172950,0]
[2104066,"Osteosíntesis epitroclea-epicóndilo (cualquier técnica)",0,null,null,null,null,{"$f":"+I2368+J2368","v":0},null,null,null,null,null,null,0,null,null,0,null,null,0,null,null,0,null,null,null,null,null,null,null,null,null,null,null,null,172940,{"$f":"AK2368*I2368","v":0}]
[2104067,"Osteosíntesis olécranon u osteosíntesis de cúpula radial (proc. aut.) (cualquier técnica)",0,null,null,null,null,0,null,null,null,null,null,null,0,null,null,0,null,null,0,null,null,0,null,null,null,null,null,null,null,null,null,null,null,null,172940,0]
[2104068,"Traslocación nervio cubital (proc. aut.)",{"$f":"SUM(I2370:N2370)","v":0},null,null,null,null,0,null,null,null,null,null,null,{"$f":"SUM(P2370:Q2370)","v":0},null,null,0,null,null,0,null,null,0,null,null,null,null,null,null,null,null,null,null,null,null,217100,0]
[2104069,"Operación de salvataje radio-procúbito",0,null,null,null,null,0,null,null,null,null,null,null,0,null,null,0,null,null,0,null,null,0,null,null,null,null,null,null,null,null,null,null,null,null,195710,0]
[2104070,"Amputación antebrazo",0,null,null,null,null,0,null,null,null,null,null,null,0,null,null,0,null,null,0,null,null,0,null,null,null,null,null,null,null,null,null,null,null,null,195710,0]
[2104071,"Extirpación metáfisis distal del cúbito y artrodesis radiocubital inferior",0,null,null,null,null,0,null,null,null,null,null,null,0,null,null,0,null,null,{"$f":"SUM(V2373:W2373)","v":0},null,null,0,null,null,null,null,null,null,null,null,null,null,null,null,172940,0]
[2104072,"Luxofracturas (Monteggia-Galeazzi), reducc. y osteosíntesis",0,null,null,null,null,0,null,null,null,null,null,null,0,null,null,0,null,null,0,null,null,0,null,null,null,null,null,null,null,null,null,null,null,null,172940,0]
[2104073,"Osteosíntesis, fract. cerrada cubito y/o radio (cualq. técn.)",0,null,null,null,null,0,null,null,null,null,null,null,0,null,null,0,null,null,0,null,null,0,null,null,null,null,null,null,null,null,null,null,null,null,172940,0]
[2104074,"Osteotomía uno o ambos huesos, c/s ostesíntesis c/s yeso o trat. quir. Enf. de Kienbock",0,null,null,null,null,0,null,null,null,null,null,null,0,null,null,{"$f":"SUM(S2376:T2376)","v":0},null,null,0,null,null,{"$f":"SUM(Y2376:Z2376)","v":0},null,null,null,null,null,null,null,null,null,null,null,null,172940,0]
[2104075,"Pseudoartrosis  cúbito y/o radio c/s osteosíntesis c/s yeso",0,null,null,null,null,0,null,null,null,null,null,null,0,null,null,0,null,null,0,null,null,0,null,null,null,null,null,null,null,null,null,null,null,null,172940,0]
[2104076,"Sinostosis radio-cubital, trat. quir., c/s injerto",0,null,null,null,null,0,null,null,null,null,null,null,0,null,null,0,null,null,0,null,null,0,null,null,null,null,null,null,null,null,null,null,null,null,179120,0]
[2104077,"Trasplantes músculo-tendinosos",0,null,null,null,null,0,null,null,null,null,null,null,0,null,null,0,null,null,0,null,null,0,null,null,null,null,null,null,null,null,null,null,null,null,227170,0]
[2104078,"Contractura isquem. de Volkmann: descenso muscular, neurolisis",0,null,null,null,null,0,null,null,null,null,null,null,0,null,null,0,null,null,0,null,null,0,null,null,null,null,null,null,null,null,null,null,null,null,227170,0]
[2104079,"Endoprótesis total (cualquier técnica)",0,null,null,null,null,0,null,null,null,null,null,null,0,null,null,0,null,null,0,null,null,0,null,null,null,null,null,null,null,null,null,null,null,null,328100,0]
[2104080,"Estiloides cubital, radial, resección de.",0,null,null,null,null,0,null,null,null,null,null,null,0,null,null,0,null,null,0,null,null,0,null,null,null,null,null,null,null,null,null,null,null,null,161060,0]
[2104081,"Fractura o pseudoartrosis escafoides, trat. quir. cualq. técn.",0,null,null,null,null,0,null,null,null,null,null,null,0,null,null,0,null,null,0,null,null,0,null,null,null,null,null,null,null,null,null,null,null,null,161090,0]
[2104082,"Implante silastic o similares (escafoides, semilunar)",0,null,null,null,null,0,null,null,null,null,null,null,0,null,null,0,null,null,0,null,null,0,null,null,null,null,null,null,null,null,null,null,null,null,172950,0]
[2104083,"Luxación radiocarpiana, trat. quir.",0,null,null,null,null,0,null,null,null,null,null,null,0,null,null,0,null,null,0,null,null,0,null,null,null,null,null,null,null,null,null,null,null,null,161060,0]
[2104084,"Luxación semilunar ,escafoidea, reducción y osteosíntesis semicruenta o cruenta",0,null,null,null,null,0,null,null,null,null,null,null,0,null,null,0,null,null,0,null,null,0,null,null,null,null,null,null,null,null,null,null,null,null,161090,0]
[2104085,"Osteosíntesis radio, (cualquier técnica)",0,null,null,null,null,0,null,null,null,null,null,null,0,null,null,0,null,null,0,null,null,0,null,null,null,null,null,null,null,null,null,null,null,null,172940,0]
[2104086,"Tendovaginosis de De Quervain, trat. quir.",0,null,null,null,null,0,null,null,null,null,null,null,0,null,null,0,null,null,0,null,null,0,null,null,null,null,null,null,null,null,null,null,null,null,172940,0]
[2104087,"Amputación dedos (tres o más)",0,null,null,null,null,0,null,null,null,null,null,null,0,null,null,0,null,null,0,null,null,0,null,null,null,null,null,null,null,null,null,null,null,null,174330,0]
[2104088,"Amputación dedos (uno o dos)",0,null,null,null,null,0,null,null,null,null,null,null,null,null,null,null,null,null,null,null,null,null,null,null,null,null,null,null,null,null,null,null,null,null,127750,0]
[2104089,"Amputación mano o del pulgar",0,null,null,null,null,0,null,null,null,null,null,null,0,null,null,0,null,null,0,null,null,0,null,null,null,null,null,null,null,null,null,null,null,null,200520,0]
[2104090,"Amputación pulpejos (plastía Kutler o similares)",0,null,null,null,null,0,null,null,null,null,null,null,null,null,null,null,null,null,null,null,null,null,null,null,null,null,null,null,null,null,null,null,null,null,151570,0]
[2104091,"Contractura Dupuytren, trat. quir., cada tiempo",0,null,null,null,null,0,null,null,null,null,null,null,0,null,null,0,null,null,0,null,null,0,null,null,null,null,null,null,null,null,null,null,null,null,161060,0]
[2104092,"Contusión-compresión grave, trat. quir. incluye incisiones liberadoras y/o fasciotomía y/o escarectomía y/o injertos piel inmediatos y síntesis percutánea",0,null,null,null,null,0,null,null,null,null,null,null,0,null,null,0,null,null,0,null,null,0,null,null,null,null,null,null,null,null,null,null,null,null,161090,0]
[2104093,"Dedos en gatillo, trat. quir., cualquier número",0,null,null,null,null,0,null,null,null,null,null,null,null,null,null,null,null,null,null,null,null,null,null,null,null,null,null,null,null,null,null,null,null,null,151570,0]
[2104094,"Flegmón mano, trat. quir.",0,null,null,null,null,0,null,null,null,null,null,null,null,null,null,null,null,null,null,null,null,null,null,null,null,null,null,null,null,null,null,null,null,null,143160,0]
[2104095,"Luxofractura metacarpofalángica o interfalángica, trat. quir.",0,null,null,null,null,0,null,null,null,null,null,null,null,null,null,null,null,null,null,null,null,null,null,null,null,null,null,null,null,null,null,null,null,null,151570,0]
[2104096,"Mano reumática en ráfaga: traslocaciones tendinosas, plastías capsulares, tenotomías, inmovilización postoperatoria",0,null,null,null,null,0,null,null,null,null,null,null,0,null,null,0,null,null,0,null,null,0,null,null,null,null,null,null,null,null,null,null,null,null,182650,0]
[2104097,"Mano reumática: implant. silastic, cualq. número (proc. aut.)",0,null,null,null,null,0,null,null,null,null,null,null,0,null,null,0,null,null,0,null,null,0,null,null,null,null,null,null,null,null,null,null,null,null,199270,0]
[2104098,"Mutilación grave, aseo. quir. completo c/s osteosíntesis, c/s injertos",0,null,null,null,null,0,null,null,null,null,null,null,0,null,null,0,null,null,0,null,null,0,null,null,null,null,null,null,null,null,null,null,null,null,170470,0]
[2104099,"Osteosíntesis metacarpianas o de falanges, cualquier técnica",0,null,null,null,null,0,null,null,null,null,null,null,null,null,null,null,null,null,null,null,null,null,null,null,null,null,null,null,null,null,null,null,null,null,151570,0]
[2104100,"Panadizo, trat. quir.",0,null,null,null,null,0,null,null,null,null,null,null,null,null,null,null,null,null,null,null,null,null,null,null,null,null,null,null,null,null,null,null,null,null,23420,0]
[2104101,"Pulgarización dedo (índice o anular)",0,null,null,null,null,0,null,null,null,null,null,null,0,null,null,0,null,null,0,null,null,0,null,null,null,null,null,null,null,null,null,null,null,null,252640,0]
[2104102,"Reimplante mano o dedo(s)",0,null,null,null,null,0,null,null,null,null,null,null,0,null,null,0,null,null,0,null,null,0,null,null,null,null,null,null,null,null,null,null,null,null,618300,0]
[2104103,"Reparación flexores: primer tiempo espaciador silastic",0,null,null,null,null,0,null,null,null,null,null,null,0,null,null,0,null,null,0,null,null,0,null,null,null,null,null,null,null,null,null,null,null,null,172890,0]
[2104104,"Reparación nervio digital con injerto interfascicular: cualquier número",0,null,null,null,null,0,null,null,null,null,null,null,0,null,null,0,null,null,0,null,null,0,null,null,null,null,null,null,null,null,null,null,null,null,275970,0]
[2104105,"Rupturas cerradas cápsulo-ligament. o tendinosas, trat. quir.",0,null,null,null,null,0,null,null,null,null,null,null,0,null,null,0,null,null,0,null,null,0,null,null,null,null,null,null,null,null,null,null,null,null,161060,0]
[2104106,"Sutura nervio(s) digital(es); microcirugía",0,null,null,null,null,0,null,null,null,null,null,null,0,null,null,0,null,null,0,null,null,0,null,null,null,null,null,null,null,null,null,null,null,null,219060,0]
[2104107,"Tenorrafia extensores",0,null,null,null,null,0,null,null,null,null,null,null,0,null,null,0,null,null,0,null,null,0,null,null,null,null,null,null,null,null,null,null,null,null,161060,0]
[2104108,"Tenorrafia o injertos flexores",0,null,null,null,null,0,null,null,null,null,null,null,0,null,null,0,null,null,0,null,null,0,null,null,null,null,null,null,null,null,null,null,null,null,161060,0]
[2104109,"Tenosinovitis séptica, trat. quir.",0,null,null,null,null,0,null,null,null,null,null,null,null,null,null,null,null,null,null,null,null,null,null,null,null,null,null,null,null,null,null,null,null,null,50370,0]
[2104110,"Trasplante microquirúrgico para pulgar",0,null,null,null,null,0,null,null,null,null,null,null,0,null,null,0,null,null,0,null,null,0,null,null,null,null,null,null,null,null,null,null,null,null,475780,0]
[2104111,"Transposiciones tendinosas flexoras o extensoras",0,null,null,null,null,0,null,null,null,null,null,null,0,null,null,0,null,null,0,null,null,0,null,null,null,null,null,null,null,null,null,null,null,null,161060,0]
[2104112,"Diastematomielia, resección espolón c/s instrumentación",0,null,null,null,null,0,null,null,null,null,null,null,0,null,null,0,null,null,0,null,null,0,null,null,null,null,null,null,null,null,null,null,null,null,488240,0]
[2104113,"Escoliosis, trat. quir., cualquier vía de abordaje, e instrumentación de Harrington,  Luque, Dwyer o similares (no inclute material de fijación de columna)",0,null,null,null,null,0,null,null,null,null,null,null,0,null,null,0,null,null,0,null,null,0,null,null,null,null,null,null,null,null,null,null,null,null,694570,0]
[2104213,"Escoliosis, trat. quir., cualquier vía de abordaje, con instrumentación (incluye elementos de osteosíntesis)",0,null,null,null,null,0,null,null,null,null,null,null,0,null,null,0,null,null,0,null,null,0,null,null,null,null,null,null,null,null,null,null,null,null,3368050,0]
[2104114,"Espondilodiscitis vertebral (TBC u otra), trat. quir. del foco, c/s artrodesis",0,null,null,null,null,0,null,null,null,null,null,null,0,null,null,0,null,null,0,null,null,0,null,null,null,null,null,null,null,null,null,null,null,null,299740,0]
[2104115,"Fractura apófisis espinosa, trat. quir.",0,null,null,null,null,0,null,null,null,null,null,null,0,null,null,0,null,null,0,null,null,0,null,null,null,null,null,null,null,null,null,null,null,null,189440,0]
[2104116,"Luxaciones, luxofracturas vertebrales (cervical, dorsal, lumbar), reducción cruenta, cualquier vía de abordaje, cualquier número",0,null,null,null,null,0,null,null,null,null,null,null,0,null,null,0,null,null,0,null,null,0,null,null,null,null,null,null,null,null,null,null,null,null,375560,0]
[2104117,"Osteotomías vertebrales correctoras, c/s instrumentación, c/s injertos óseos, c/s artrodesis",0,null,null,null,null,0,null,null,null,null,null,null,0,null,null,0,null,null,0,null,null,0,null,null,null,null,null,null,null,null,null,null,null,null,569240,0]
[2104118,"Plastías costales, cualquier número",0,null,null,null,null,0,null,null,null,null,null,null,0,null,null,0,null,null,0,null,null,0,null,null,null,null,null,null,null,null,null,null,null,null,161060,0]
[2104119,"Reemplazo cuerpo vertebral con artrodesis c/s osteosíntesis c/s instrumentación",0,null,null,null,null,0,null,null,null,null,null,null,0,null,null,0,null,null,0,null,null,0,null,null,null,null,null,null,null,null,null,null,null,null,712010,0]
[2104120,"Resección arco neural (operación de Gill o similares)",0,null,null,null,null,0,null,null,null,null,null,null,0,null,null,0,null,null,0,null,null,0,null,null,null,null,null,null,null,null,null,null,null,null,275970,0]
[2104121,"Resección del coxis",0,null,null,null,null,0,null,null,null,null,null,null,0,null,null,0,null,null,0,null,null,0,null,null,null,null,null,null,null,null,null,null,null,null,161060,0]
[2104122,"Osteosintesis en fractura de arco anterior de pelvis y disyunciones pubianas",0,null,null,null,null,0,null,null,null,null,null,null,0,null,null,0,null,null,0,null,null,0,null,null,null,null,null,null,null,null,null,null,null,null,254990,0]
[2104123,"Fractura, osteosíntesis quir.",0,null,null,null,null,0,null,null,null,null,null,null,0,null,null,0,null,null,0,null,null,0,null,null,null,null,null,null,null,null,null,null,null,null,275970,0]
[2104124,"Osteotomía pelviana (Salter, Chiari o similares)",0,null,null,null,null,0,null,null,null,null,null,null,0,null,null,0,null,null,0,null,null,0,null,null,null,null,null,null,null,null,null,null,null,null,281970,0]
[2104125,"Triple osteotomía de pelvis",0,null,null,null,null,0,null,null,null,null,null,null,0,null,null,0,null,null,0,null,null,0,null,null,null,null,null,null,null,null,null,null,null,null,299740,0]
[2104126,"Amputación inter-ilio abdominal",0,null,null,null,null,0,null,null,null,null,null,null,0,null,null,0,null,null,0,null,null,0,null,null,null,null,null,null,null,null,null,null,null,null,516790,0]
[2104127,"Desarticulación cadera",0,null,null,null,null,0,null,null,null,null,null,null,0,null,null,0,null,null,0,null,null,0,null,null,null,null,null,null,null,null,null,null,null,null,418450,0]
[2104128,"Endoprótesis parcial c/s cementación (cualquier técnica) (no incluye prótesis)",0,null,null,null,null,0,null,null,null,null,null,null,0,null,null,0,null,null,0,null,null,0,null,null,null,null,null,null,null,null,null,null,null,null,300980,0]
[2104228,"Endoprótesis parcial c/s cementación (cualquier técnica) (incluye prótesis)",0,null,null,null,null,{"$f":"+I2432+J2432","v":0},null,null,null,null,null,null,0,null,null,0,null,null,0,null,null,0,null,null,null,null,null,null,null,null,null,null,null,null,700560,{"$f":"AK2432*I2432","v":0}]
[2104129,"Endoprótesis total de cadera  (no incluye prótesis)",0,null,null,null,null,0,null,null,null,null,null,null,0,null,null,0,null,null,0,null,null,0,null,null,null,null,null,null,null,null,null,null,null,null,465830,0]
[2104229,"Endoprótesis total de cadera (incluye prótesis)",{"$f":"SUM(I2434:N2434)","v":0},null,null,null,null,0,null,null,null,null,null,null,{"$f":"SUM(P2434:Q2434)","v":0},null,null,0,null,null,0,null,null,0,null,null,null,null,null,null,null,null,null,null,null,null,1374990,0]
[2104130,"Epifisiolisis lenta o aguda, trat. quir.",0,null,null,null,null,0,null,null,null,null,null,null,0,null,null,0,null,null,0,null,null,0,null,null,null,null,null,null,null,null,null,null,null,null,267070,0]
[2104131,"Fractura de cuello de fémur, osteosíntesis, cualquier técnica (no incluye elementos de osteosíntesis)",0,null,null,null,null,0,null,null,null,null,null,null,0,null,null,0,null,null,0,null,null,0,null,null,null,null,null,null,null,null,null,null,null,null,316200,0]
[2104231,"Fractura de cuello de fémur, osteosíntesis, cualquier técnica (incluye elementos de osteosíntesis)",0,null,null,null,null,0,null,null,null,null,null,null,0,null,null,0,null,null,{"$f":"SUM(V2437:W2437)","v":0},null,null,0,null,null,null,null,null,null,null,null,null,null,null,null,506760,0]
[2104132,"Fractura de cuello de fémur, resección epífisis femoral",0,null,null,null,null,0,null,null,null,null,null,null,0,null,null,0,null,null,0,null,null,0,null,null,null,null,null,null,null,null,null,null,null,null,267070,0]
[2104133,"Luxación traumática, reducción cruenta",0,null,null,null,null,0,null,null,null,null,null,null,0,null,null,0,null,null,0,null,null,0,null,null,null,null,null,null,null,null,null,null,null,null,243750,0]
[2104134,"Luxofractura acetabular, trat. quir.",0,null,null,null,null,0,null,null,null,null,null,null,0,null,null,{"$f":"SUM(S2440:T2440)","v":0},null,null,0,null,null,{"$f":"SUM(Y2440:Z2440)","v":0},null,null,null,null,null,null,null,null,null,null,null,null,281970,0]
[2104135,"Operación de salvataje cadera, columna o similares",0,null,null,null,null,0,null,null,null,null,null,null,0,null,null,0,null,null,0,null,null,0,null,null,null,null,null,null,null,null,null,null,null,null,411120,0]
[2104136,"Osteotomías femorales",0,null,null,null,null,0,null,null,null,null,null,null,0,null,null,0,null,null,0,null,null,0,null,null,null,null,null,null,null,null,null,null,null,null,267070,0]
[2104137,"Reducción cruenta en luxación congénita o traumática",0,null,null,null,null,0,null,null,null,null,null,null,0,null,null,0,null,null,0,null,null,0,null,null,null,null,null,null,null,null,null,null,null,null,243750,0]
[2104138,"Reducción cruenta y acetabuloplastía femoral c/s osteotomía femoral",0,null,null,null,null,0,null,null,null,null,null,null,0,null,null,0,null,null,0,null,null,0,null,null,null,null,null,null,null,null,null,null,null,null,328490,0]
[2104139,"Reducción cruenta y osteotomía femoral",0,null,null,null,null,0,null,null,null,null,null,null,0,null,null,0,null,null,0,null,null,0,null,null,null,null,null,null,null,null,null,null,null,null,267070,0]
[2104140,"Tenotomía aductores c/s botas, con yugo (proc. aut.)",0,null,null,null,null,0,null,null,null,null,null,null,0,null,null,0,null,null,0,null,null,0,null,null,null,null,null,null,null,null,null,null,null,null,189440,0]
[2104141,"Trocanteroplastías",0,null,null,null,null,0,null,null,null,null,null,null,0,null,null,0,null,null,0,null,null,0,null,null,null,null,null,null,null,null,null,null,null,null,267070,0]
[2104142,"Amputación muslo",0,null,null,null,null,0,null,null,null,null,null,null,0,null,null,0,null,null,0,null,null,0,null,null,null,null,null,null,null,null,null,null,null,null,199290,0]
[2104143,"Epifisiodesis (fémur y/o tibia)",0,null,null,null,null,0,null,null,null,null,null,null,0,null,null,0,null,null,0,null,null,0,null,null,null,null,null,null,null,null,null,null,null,null,219060,0]
[2104144,"Osteosíntesis diafisiaria o metafisiaria (cualquier técnica)",0,null,null,null,null,0,null,null,null,null,null,null,0,null,null,0,null,null,0,null,null,0,null,null,null,null,null,null,null,null,null,null,null,null,219580,0]
[2104145,"Osteotomía correctora",0,null,null,null,null,0,null,null,null,null,null,null,0,null,null,0,null,null,0,null,null,0,null,null,null,null,null,null,null,null,null,null,null,null,219060,0]
[2104146,"Osteotomía de alargamiento o acortamiento con osteosíntesis inmediata o distracción instrumental progresiva",0,null,null,null,null,0,null,null,null,null,null,null,0,null,null,0,null,null,0,null,null,0,null,null,null,null,null,null,null,null,null,null,null,null,292860,0]
[2104147,"Osteotomía en rosario con enclavijamiento clavo telescópico",0,null,null,null,null,0,null,null,null,null,null,null,0,null,null,0,null,null,0,null,null,0,null,null,null,null,null,null,null,null,null,null,null,null,319190,0]
[2104148,"Pseudoartrosis, trat. quir. (cualquier técnica)",0,null,null,null,null,0,null,null,null,null,null,null,0,null,null,0,null,null,0,null,null,0,null,null,null,null,null,null,null,null,null,null,null,null,278350,0]
[2104149,"Ruptura y/o hernia muscular, trat. quir.",0,null,null,null,null,0,null,null,null,null,null,null,0,null,null,0,null,null,0,null,null,0,null,null,null,null,null,null,null,null,null,null,null,null,161060,0]
[2104150,"Artrotomía por cuerpos libres, osteocondritis (proc. aut)",0,null,null,null,null,0,null,null,null,null,null,null,0,null,null,0,null,null,0,null,null,0,null,null,null,null,null,null,null,null,null,null,null,null,172940,0]
[2104151,"Desarticulación rodilla",0,null,null,null,null,0,null,null,null,null,null,null,0,null,null,0,null,null,0,null,null,0,null,null,null,null,null,null,null,null,null,null,null,null,271120,0]
[2104152,"Disfunción patelo-femoral, realineamiento (cualquier técnica)",0,null,null,null,null,0,null,null,null,null,null,null,0,null,null,0,null,null,0,null,null,0,null,null,null,null,null,null,null,null,null,null,null,null,200520,0]
[2104153,"Endoprótesis total (cualquier técnica)",0,null,null,null,null,0,null,null,null,null,null,null,0,null,null,0,null,null,0,null,null,0,null,null,null,null,null,null,null,null,null,null,null,null,488240,0]
[2104154,"Fractura rótula: osteosíntesis o patelectomía parc. o total",0,null,null,null,null,0,null,null,null,null,null,null,0,null,null,0,null,null,0,null,null,0,null,null,null,null,null,null,null,null,null,null,null,null,172940,0]
[2104155,"Fracturas condíleas o de platillos tibiales, reducción, osteosíntesis  (cualquier técnica)",0,null,null,null,null,0,null,null,null,null,null,null,0,null,null,0,null,null,0,null,null,0,null,null,null,null,null,null,null,null,null,null,null,null,205220,0]
[2104156,"Inestabilidad crónica de rodilla, reconstrucción cápsuloligamentosa (cualquier técnica)",0,null,null,null,null,0,null,null,null,null,null,null,0,null,null,0,null,null,0,null,null,0,null,null,null,null,null,null,null,null,null,null,null,null,264520,0]
[2104157,"Luxación o rotura ligamentos, trat. quir. cápsulo-ligamentoso",0,null,null,null,null,0,null,null,null,null,null,null,0,null,null,0,null,null,0,null,null,0,null,null,null,null,null,null,null,null,null,null,null,null,172950,0]
[2104158,"Meniscectomía quirúrgica, interna y/o externa",0,null,null,null,null,0,null,null,null,null,null,null,0,null,null,0,null,null,0,null,null,0,null,null,null,null,null,null,null,null,null,null,null,null,172950,0]
[2104159,"Meniscectomía u otras intervenciones por vía artroscópica (incluye artroscopía diagnóstica)",0,null,null,null,null,0,null,null,null,null,null,null,0,null,null,0,null,null,0,null,null,0,null,null,null,null,null,null,null,null,null,null,null,null,247940,0]
[2104160,"Quiste poplíteo, trat. quir.",0,null,null,null,null,0,null,null,null,null,null,null,null,null,null,null,null,null,null,null,null,null,null,null,null,null,null,null,null,null,null,null,null,null,151570,0]
[2104161,"Reconstrucción aparato extensor",0,null,null,null,null,0,null,null,null,null,null,null,0,null,null,0,null,null,0,null,null,0,null,null,null,null,null,null,null,null,null,null,null,null,172950,0]
[2104162,"Reparación quirúrgica ligamentos colaterales y/o cruzados",0,null,null,null,null,0,null,null,null,null,null,null,0,null,null,0,null,null,0,null,null,0,null,null,null,null,null,null,null,null,null,null,null,null,227170,0]
[2104163,"Traslocaciones músculo-tendinosas en rodilla paralítica o espástica",0,null,null,null,null,0,null,null,null,null,null,null,0,null,null,0,null,null,0,null,null,0,null,null,null,null,null,null,null,null,null,null,null,null,227170,0]
[2104164,"Amputación pierna",0,null,null,null,null,0,null,null,null,null,null,null,0,null,null,0,null,null,0,null,null,0,null,null,null,null,null,null,null,null,null,null,null,null,222580,0]
[2104165,"Colgajo cruzado de pierna, trat. quir. completo",0,null,null,null,null,0,null,null,null,null,null,null,0,null,null,0,null,null,0,null,null,0,null,null,null,null,null,null,null,null,null,null,null,null,264150,0]
[2104166,"Fasciotomía por síndrome compartamental",0,null,null,null,null,0,null,null,null,null,null,null,0,null,null,0,null,null,0,null,null,0,null,null,null,null,null,null,null,null,null,null,null,null,161060,0]
[2104167,"Osteosíntesis tibio-peroné  (cualquier técnica)",0,null,null,null,null,0,null,null,null,null,null,null,0,null,null,0,null,null,0,null,null,0,null,null,null,null,null,null,null,null,null,null,null,null,172940,0]
[2104168,"Osteotomía correctora de ejes  (cualquier técnica)",0,null,null,null,null,0,null,null,null,null,null,null,0,null,null,0,null,null,0,null,null,0,null,null,null,null,null,null,null,null,null,null,null,null,179120,0]
[2104169,"Osteotomía de alargamiento o acortamiento con osteosíntesis inmediata o distracción instrumental progresiva",0,null,null,null,null,0,null,null,null,null,null,null,0,null,null,0,null,null,0,null,null,0,null,null,null,null,null,null,null,null,null,null,null,null,292860,0]
[2104170,"Osteotomía del peroné",0,null,null,null,null,0,null,null,null,null,null,null,0,null,null,0,null,null,0,null,null,0,null,null,null,null,null,null,null,null,null,null,null,null,161060,0]
[2104171,"Peroné protibia",0,null,null,null,null,0,null,null,null,null,null,null,0,null,null,0,null,null,0,null,null,0,null,null,null,null,null,null,null,null,null,null,null,null,199270,0]
[2104172,"Pseudoartrosis, c/s osteosíntesis  (cualquier técnica)",0,null,null,null,null,0,null,null,null,null,null,null,0,null,null,0,null,null,0,null,null,0,null,null,null,null,null,null,null,null,null,null,null,null,179120,0]
[2104173,"Desarticulación tobillo",0,null,null,null,null,0,null,null,null,null,null,null,0,null,null,0,null,null,0,null,null,0,null,null,null,null,null,null,null,null,null,null,null,null,247810,0]
[2104174,"Endoprótesis total  (cualquier técnica)",0,null,null,null,null,0,null,null,null,null,null,null,0,null,null,0,null,null,0,null,null,0,null,null,null,null,null,null,null,null,null,null,null,null,345810,0]
[2104175,"Esguince grave, trat. quir. cápsulo-ligamentoso",0,null,null,null,null,0,null,null,null,null,null,null,0,null,null,0,null,null,0,null,null,0,null,null,null,null,null,null,null,null,null,null,null,null,172940,0]
[2104176,"Fractura astrágalo y/o calcáneo, osteosíntesis (cualq. técn.)",0,null,null,null,null,0,null,null,null,null,null,null,0,null,null,0,null,null,0,null,null,0,null,null,null,null,null,null,null,null,null,null,null,null,195710,0]
[2104177,"Huesos supernumerarios, extirpación, uno o más del mismo lado",0,null,null,null,null,0,null,null,null,null,null,null,0,null,null,0,null,null,0,null,null,0,null,null,null,null,null,null,null,null,null,null,null,null,161060,0]
[2104178,"Luxación tibio-astrág.-calcán., reducc. cruenta y osteosínt.",0,null,null,null,null,0,null,null,null,null,null,null,0,null,null,0,null,null,0,null,null,0,null,null,null,null,null,null,null,null,null,null,null,null,172950,0]
[2104179,"Luxofractura tobillo, cualquier tipo, osteosíntesis y reparación cápsulo-ligamentosa",0,null,null,null,null,0,null,null,null,null,null,null,0,null,null,0,null,null,0,null,null,0,null,null,null,null,null,null,null,null,null,null,null,null,217100,0]
[2104180,"Osteoplastía tibio-calcánea",0,null,null,null,null,0,null,null,null,null,null,null,0,null,null,0,null,null,0,null,null,0,null,null,null,null,null,null,null,null,null,null,null,null,195710,0]
[2104181,"Ruptura tendón de Aquiles o tibial posterior, tenorrafia primaria y/o transposiciones tendinosas",0,null,null,null,null,0,null,null,null,null,null,null,0,null,null,0,null,null,0,null,null,0,null,null,null,null,null,null,null,null,null,null,null,null,179120,0]
[2104182,"Ruptura tibial anterior u otros, tenorrafia",0,null,null,null,null,0,null,null,null,null,null,null,0,null,null,0,null,null,0,null,null,0,null,null,null,null,null,null,null,null,null,null,null,null,172940,0]
[2104183,"Tenorrafia extensores o tenotomía de alargamiento de tendón de Aquiles",0,null,null,null,null,0,null,null,null,null,null,null,0,null,null,0,null,null,0,null,null,0,null,null,null,null,null,null,null,null,null,null,null,null,161090,0]
[2104184,"Traslocación tendinosa",0,null,null,null,null,0,null,null,null,null,null,null,0,null,null,0,null,null,0,null,null,0,null,null,null,null,null,null,null,null,null,null,null,null,172950,0]
[2104185,"Amputación transmetatarsiana",0,null,null,null,null,0,null,null,null,null,null,null,0,null,null,0,null,null,0,null,null,0,null,null,null,null,null,null,null,null,null,null,null,null,195710,0]
[2104186,"Astrágalo vertical, trat. quir.",0,null,null,null,null,0,null,null,null,null,null,null,0,null,null,0,null,null,0,null,null,0,null,null,null,null,null,null,null,null,null,null,null,null,179110,0]
[2104187,"Espolón calcáneo, trat. quir.",0,null,null,null,null,0,null,null,null,null,null,null,0,null,null,0,null,null,0,null,null,0,null,null,null,null,null,null,null,null,null,null,null,null,161060,0]
[2104188,"Exostosis 5° metatarsiano, (\"juanetillo\")  trat. quir.",0,null,null,null,null,0,null,null,null,null,null,null,0,null,null,0,null,null,0,null,null,0,null,null,null,null,null,null,null,null,null,null,null,null,161060,0]
[2104189,"Fasciotomía plantar (proc. aut.)",0,null,null,null,null,0,null,null,null,null,null,null,0,null,null,0,null,null,0,null,null,0,null,null,null,null,null,null,null,null,null,null,null,null,161060,0]
[2104190,"Hallux valgus o rígidus, trat.quir. completo (cualquier téc.)",0,null,null,null,null,{"$f":"+I2496+J2496","v":0},null,null,null,null,null,null,0,null,null,0,null,null,0,null,null,0,null,null,null,null,null,null,null,null,null,null,null,null,161090,{"$f":"AK2496*I2496","v":0}]
[2104191,"Luxaciones, luxofracturas, fracturas, reducción cruenta",0,null,null,null,null,0,null,null,null,null,null,null,0,null,null,0,null,null,0,null,null,0,null,null,null,null,null,null,null,null,null,null,null,null,172950,0]
[2104192,"Mal perforante plantar, trat. quir.",{"$f":"SUM(I2498:N2498)","v":0},null,null,null,null,0,null,null,null,null,null,null,{"$f":"SUM(P2498:Q2498)","v":0},null,null,0,null,null,0,null,null,0,null,null,null,null,null,null,null,null,null,null,null,null,172950,0]
[2104193,"Neuroma de Morton, trat. quir.",0,null,null,null,null,0,null,null,null,null,null,null,0,null,null,0,null,null,0,null,null,0,null,null,null,null,null,null,null,null,null,null,null,null,161060,0]
[2104194,"Ortejos en garra, trat. quir., cualq. número (cualq. técnica)",0,null,null,null,null,0,null,null,null,null,null,null,0,null,null,0,null,null,0,null,null,0,null,null,null,null,null,null,null,null,null,null,null,null,161060,0]
[2104195,"Ortejos, amputación, uno o más del mismo pie",0,null,null,null,null,0,null,null,null,null,null,null,0,null,null,0,null,null,{"$f":"SUM(V2501:W2501)","v":0},null,null,0,null,null,null,null,null,null,null,null,null,null,null,null,161060,0]
[2104196,"Pie bot u otras malformaciones congénitas, trat. quir. (cualquier técnica)",0,null,null,null,null,0,null,null,null,null,null,null,0,null,null,0,null,null,0,null,null,0,null,null,null,null,null,null,null,null,null,null,null,null,179110,0]
[2104197,"Pie cavo, trat. quir. (cualquier técnica)",0,null,null,null,null,0,null,null,null,null,null,null,0,null,null,0,null,null,0,null,null,0,null,null,null,null,null,null,null,null,null,null,null,null,161090,0]
[2104198,"Pie plano, trat. quir. (cualquier técnica)",0,null,null,null,null,0,null,null,null,null,null,null,0,null,null,{"$f":"SUM(S2504:T2504)","v":0},null,null,0,null,null,{"$f":"SUM(Y2504:Z2504)","v":0},null,null,null,null,null,null,null,null,null,null,null,null,161090,0]
[2104199,"Pie reumatoídeo, trat. quir. completo (cualquier técnica)",0,null,null,null,null,0,null,null,null,null,null,null,0,null,null,0,null,null,0,null,null,0,null,null,null,null,null,null,null,null,null,null,null,null,182650,0]
[2104200,"Sesamoídeos, extirpación de uno o más del mismo pie",0,null,null,null,null,0,null,null,null,null,null,null,0,null,null,0,null,null,0,null,null,0,null,null,null,null,null,null,null,null,null,null,null,null,161090,0]
[2104201,"Tenorrafia extensores",0,null,null,null,null,0,null,null,null,null,null,null,0,null,null,0,null,null,0,null,null,0,null,null,null,null,null,null,null,null,null,null,null,null,161060,0]
[2104202,"Transplantes tendinosos (cualquier técnica)",0,null,null,null,null,0,null,null,null,null,null,null,0,null,null,0,null,null,0,null,null,0,null,null,null,null,null,null,null,null,null,null,null,null,172950,0]
[null,"Total ARANCEL MAI",{"$f":"SUM(C2304:C2508)","v":0},null,null,null,null,{"$f":"SUM(H2304:H2508)","v":0},0,0,0,0,0,0,{"$f":"SUM(O2304:O2508)","v":0},0,0,0,0,0,0,0,0,0,0,0,0,0,0,0,0,0,0,0,0,0,49797420,0]
[null,"Sinoviortesis en paciente hemofílico ",0,null,null,null,null,0,null,null,null,null,null,null,0,null,null,0,null,null,0,null,null,0]
[null,"Otras cirugías periarticulares hemofilicos ",0,null,null,null,null,0,null,null,null,null,null,null,{"$f":"SUM(P2511:Q2511)","v":0},null,null,0,null,null,0,null,null,0]
[null,"Amputaciones pie diabético",0,null,null,null,null,{"$f":"+I2512","v":0},null,null,null,null,null,null,0,null,null,0,null,null,0,null,null,0]
[null,"Amputación de ortejo(s) por pie diabético ",0,null,null,null,null,{"$f":"+I2513","v":0},null,null,null,null,null,null,0,null,null,0,null,null,0,null,null,0]
[null,"Amputación de pie completo por pie diabético ",0,null,null,null,null,{"$f":"+I2514","v":0},null,null,null,null,null,null,{"$f":"SUM(P2514:Q2514)","v":0},null,null,0,null,null,0,null,null,0]
[null,"TOTAL ARANCEL MLE Y NO ARANCELADO",{"$f":"SUM(C2510:C2514)","v":0},null,null,null,null,{"$f":"SUM(H2510:H2514)","v":0},0,0,0,0,0,0,0,0,0,0,0,0,0,0,0,0,0,0,0,0,0,0,0,0,0,0,0,0]
[null,"TOTAL PRODUCCION",{"$f":"C2509","v":0},null,null,null,null,{"$f":"H2509","v":0},{"$f":"I2509","v":0},0,0,0,0,0,{"$f":"SUM(O2509+O2515)","v":0},{"$f":"P2509","v":0},{"$f":"Q2509","v":0},0,{"$f":"S2509","v":0},{"$f":"T2509","v":0},0,{"$f":"V2509","v":0},{"$f":"W2509","v":0},0,{"$f":"Y2509","v":0},{"$f":"Z2509","v":0},0,0,0,0,0,0,0,0,0,0,49797420,0]
[null,"RETIRO DE ELEMENTOS DE OSTEOSINTESIS             "]
[2106001,"Retiro de endoprótesis u osteosíntesis internas articulares o de columna vertebral",{"$f":"SUM(I2518:N2518)","v":0},null,null,null,null,{"$f":"+I2518+J2518","v":0},null,null,null,null,null,null,{"$f":"SUM(P2518:Q2518)","v":0},null,null,{"$f":"SUM(S2518:T2518)","v":0},null,null,{"$f":"SUM(V2518:W2518)","v":0},null,null,{"$f":"SUM(Y2518:Z2518)","v":0},null,null,null,null,null,null,null,null,null,null,null,null,212790,{"$f":"AK2518*I2518","v":0}]
[2106002,"Retiro de placas rectas o anguladas",{"$f":"SUM(I2519:N2519)","v":0},null,null,null,null,0,null,null,null,null,null,null,{"$f":"SUM(P2519:Q2519)","v":0},null,null,{"$f":"SUM(S2519:T2519)","v":0},null,null,{"$f":"SUM(V2519:W2519)","v":0},null,null,{"$f":"SUM(Y2519:Z2519)","v":0},null,null,null,null,null,null,null,null,null,null,null,null,118570,{"$f":"AK2519*I2519","v":0}]
[2106003,"Retiro de tornillos, clavos, agujas de osteosíntesis o similares",{"$f":"SUM(I2520:N2520)","v":0},null,null,null,null,0,null,null,null,null,null,null,{"$f":"SUM(P2520:Q2520)","v":0},null,null,{"$f":"SUM(S2520:T2520)","v":0},null,null,{"$f":"SUM(V2520:W2520)","v":0},null,null,{"$f":"SUM(Y2520:Z2520)","v":0},null,null,null,null,null,null,null,null,null,null,null,null,59390,{"$f":"AK2520*I2520","v":0}]
[null,"TOTAL",{"$f":"SUM(C2518:C2520)","v":0},null,null,null,null,{"$f":"SUM(H2518:H2520)","v":0},0,0,0,0,0,0,0,0,0,0,0,0,0,0,0,0,0,0,0,0,0,0,0,0,0,0,0,0,390750,0]
[null,"Procedimientos Ortopédicos"]
[2107001,"Luxaciones de articulaciones medianas (hombro, codo, rodilla, tobillo, muñeca, tarso y esternoclavicular)",{"$f":"SUM(D2523+G2523)","v":0},{"$f":"SUM(E2523:F2523)","v":0},null,null,null,null,null,null,null,null,null,null,null,null,null,null,null,null,null,null,null,null,null,null,null,null,null,null,null,null,null,null,null,null,66930,{"$f":"AK2523*E2523","v":0}]
[2107002,"Luxaciones de articulaciones  mayores (columna, cadera, pelvis)",0,0,null,null,null,null,null,null,null,null,null,null,null,null,null,null,null,null,null,null,null,null,null,null,null,null,null,null,null,null,null,null,null,null,82380,0]
[2107003,"Luxaciones de articulaciones menores (el resto)      ",0,0,null,null,null,null,null,null,null,null,null,null,null,null,null,null,null,null,null,null,null,null,null,null,null,null,null,null,null,null,null,null,null,null,29490,0]
[2107004,"Fracturas mayores (columna, pelvis, supracondílea, codo, epífisis femorales)",0,0,null,null,null,null,null,null,null,null,null,null,null,null,null,null,null,null,null,null,null,null,null,null,null,null,null,null,null,null,null,null,null,null,115270,0]
[2107005,"Fracturas medianas (diáfisis humeral, radial, cubital, diáfisis femoral, tibial, peroneal, clavicular, platillos tibiales)",0,0,null,null,null,null,null,null,null,null,null,null,null,null,null,null,null,null,null,null,null,null,null,null,null,null,null,null,null,null,null,null,null,null,92640,0]
[2107006,"Fracturas menores (el resto)",0,0,null,null,null,null,null,null,null,null,null,null,null,null,null,null,null,null,null,null,null,null,null,null,null,null,null,null,null,null,null,null,null,null,46330,0]
[2107007,"Tto.funcional c/técnica Sarmiento y similares- Extremidad inferior",0,0,null,null,null,null,null,null,null,null,null,null,null,null,null,null,null,null,null,null,null,null,null,null,null,null,null,null,null,null,null,null,null,null,93550,0]
[2107008,"Tto.funcional c/técnica Sarmiento y similares- Extremidad superior",0,0,null,null,null,null,null,null,null,null,null,null,null,null,null,null,null,null,null,null,null,null,null,null,null,null,null,null,null,null,null,null,null,null,83410,0]
[2107009,"Luxación congénita de cadera, trat. ortopédico completo (uni o bilateral)",0,0,null,null,null,null,null,null,null,null,null,null,null,null,null,null,null,null,null,null,null,null,null,null,null,null,null,null,null,null,null,null,null,null,85990,0]
[2107010,"Pie bot, cada pie, hasta 10 cambios de yeso",0,0,null,null,null,null,null,null,null,null,null,null,null,null,null,null,null,null,null,null,null,null,null,null,null,null,null,null,null,null,null,null,null,null,85990,0]
[null,"TOTAL",{"$f":"SUM(C2523:C2532)","v":0},{"$f":"SUM(D2523:D2532)","v":0},0,0,0,null,null,null,null,null,null,null,null,null,null,null,null,null,null,null,null,null,null,null,0,0,0,0,0,0,0,0,0,0,781980,0]
["PROTESIS  Y ORTESIS"]
[2301002,"Ortesis cervicales (collares blandos y duros)",0,0]
[2301008,"Braguero (Hernia Umbilical o Inguinal)",0,0]
[2301011,"Faja Ortopédica (Contensión de Abdomen o Columna Dorsolumbar)",0,0]
[2301020,"Ortesis Muslo-Pie o Isquiopedio",0,0]
[2301021,"Arnés de Prótesis (Extremidad Superior)",0,0]
[2301022,"Bastón canadiense o trípode, c/u",0,0]
[2301024,"Rodillera",0,0]
[2301029,"Cojín de abducción o Paulik",0,0]
[2301030,"Correa de ortesis",0,0]
[2301031,"Correa de Muley (Prótesis bajo rodilla)",0,0]
[2301032,"Ortesis de columna (Milwaukee, Taylor o similares)",0,0]
[2301033,"Ortesis lumbosacra (Corset de Knight)",0,0]
[2301034,"Ortesis palmar activa (UCLA)",0,0]
[2301035,"Ortesis radial de posición",0,0]
[2301036,"Ortesis corta de posición (digitales) c/u",0,0]
[2301037,"Ortesis de uso nocturno de miembro inferior",0,0]
[2301038,"Ortesis Larga de Posición (Extremidad Superior)",0,0]
[2301040,"Muletas (par)",0,0]
[2301041,"Ortesis Larga bilateral con cinturón pélvico (Extremidades Inferiores)",0,0]
[2301042,"Ortesis Larga unilateral (Extremidad Inferior)",0,0]
[2301043,"Ortesis mano-muñeca pasiva",0,0]
[2301044,"Ortesis para rodilla",0,0]
[2301045,"Ortesis tobillo-pie",0,0]
[2301067,"Talonera goma (par)",0,0]
[5099074,"Ortesis parálisis cubital",0,0]
[5099075,"Ortesis tendones flexores",0,0]
[5099076,"Ortesis digital dinámica",{"$f":"SUM(D2561+G2561)","v":0},{"$f":"SUM(E2561:F2561)","v":0}]
[5099065,"Canaletas  bipedestación",0,0]
[5099066,"Correas desrotadoras ",0,0]
[5099067,"Correa dorsiflexion pie",0,0]
[5099068,"Férula abducción hombro",0,0]
[5099069,"Férula extension codo",0,0]
[5099070,"Férula extension muñeca",0,0]
[5099071,"Férula flexion muñeca",0,0]
[5099072,"Palmeta extensión muñeca y dedos",0,0]
[5099073,"Correas desrotadoras parálisis braquial obstétrica",0,0]
[5099077,"Camiseta manga larga ",0,0]
[5099078,"Camiseta manga corta",0,0]
[5099079,"Manga larga ",0,0]
[5099080,"Manga corta",0,0]
[5099081,"Pantalón largo ",0,0]
[5099082,"Pantalón corto ",0,0]
[5099083,"Media larga",0,0]
[5099084,"Media corta",0,0]
[5099085,"Media tipo calcetín",0,0]
[5099086,"Guante tipo mitón",0,0]
[5099087,"Guante con dedos",0,0]
[5099088,"Máscara",0,0]
[5099089,"Mentonera",0,0]
[5099090,"Cintillo",0,0]
[5099061,"Collar cervical semirígido",0,0]
[5099062,"Collar cervical blando",0,0]
[null,"Canaletas  bipedestación ",0,0]
[null,"TOTAL",{"$f":"SUM(C2535:C2587)","v":0},{"$f":"SUM(D2535:D2587)","v":0},0,0,0,null,null,null,null,null,null,null,null,null,null,null,null,null,null,null,null,null,null,null,0,0,0,0,0,0,0,0,0,0]
[null,"GRUPO 22 : ANESTESIA                                             "]
[2201102,"Anestesia peridural o epidural  continua para partos",0,0,null,null,null,null,null,null,null,null,null,null,null,null,null,null,null,null,null,null,null,null,null,null,null,null,null,null,null,null,null,null,null,null,30800,{"$f":"AK2590*E2590","v":0}]
[null,"TOTAL",{"$f":"C2590","v":0},{"$f":"D2590","v":0},{"$f":"E2590","v":0},0,0,null,null,null,null,null,null,null,null,null,null,null,null,null,null,null,null,null,null,null,0,0,0,0,0,0,0,0,0,0,30800,0]
[null,"OTROS PROCEDIMIENTOS ANESTÉSICOS"]
[2201001,"Anestesia general o regional otorgada por médico diferente al primer cirujano (en intervenciones o procedimientos diagnósticos o terapéuticos)",0,0]
[2201002,"Anestesia peridural continua, proc. aut.",0,0]
[null,"Intubación nasotraqueal/orotraqueal",0,0]
[null,"Anestesia general como apoyo a resonancia magnética",0,0]
[null,"Anestesia general como apoyo a tomografía computada",0,0]
[null,"Sedación como apoyo a examen y/o procedimiento",0,0]
[null,"Anestesia regional o local infiltrativa administrada por cirujano",0,0]
[null,"TOTAL",{"$f":"SUM(C2593:C2599)","v":0},{"$f":"SUM(D2593:D2599)","v":0},{"$f":"SUM(E2593:E2599)","v":0},{"$f":"SUM(F2593:F2599)","v":0},{"$f":"SUM(G2593:G2599)","v":0},null,null,null,null,null,null,null,null,null,null,null,null,null,null,null,null,null,null,null,{"$f":"SUM(AA2593:AA2599)","v":0},0,0,0,0,0,0,0,0,0]
[null,"GRUPO 24 : RESCATES, TRASLADOS Y RONDAS RURALES  "]
[2401061,"Rescate simple y/o traslado en móvil 1",0,0,null,null,null,null,null,null,null,null,null,null,null,null,null,null,null,null,null,null,null,null,null,null,null,null,null,null,null,null,null,null,null,null,20290,{"$f":"AK2602*E2602","v":0}]
[2401062,"Rescate profesionalizado y/o traslado paciente complejo móvil 2",0,0,null,null,null,null,null,null,null,null,null,null,null,null,null,null,null,null,null,null,null,null,null,null,null,null,null,null,null,null,null,null,null,null,63840,0]
[2401063,"Rescate medicalizado y/o traslado paciente critico en móvil 3",0,0,null,null,null,null,null,null,null,null,null,null,null,null,null,null,null,null,null,null,null,null,null,null,null,null,null,null,null,null,null,null,null,null,79130,0]
[2401064,"Traslado en ambulancia",0,0,null,null,null,null,null,null,null,null,null,null,null,null,null,null,null,null,null,null,null,null,null,null,null,null,null,null,null,null,null,null,null,null,2780,0]
[2401065,"Ronda rural terrestre, c/ km recorrido",0,0,null,null,null,null,null,null,null,null,null,null,null,null,null,null,null,null,null,null,null,null,null,null,null,null,null,null,null,null,null,null,null,null,70,0]
[2401066,"Ronda rural aérea, c/ hora de vuelo",0,0,null,null,null,null,null,null,null,null,null,null,null,null,null,null,null,null,null,null,null,null,null,null,null,null,null,null,null,null,null,null,null,null,168000,0]
[2401067,"Ronda rural marítima, c/ hora de navegación",0,0,null,null,null,null,null,null,null,null,null,null,null,null,null,null,null,null,null,null,null,null,null,null,null,null,null,null,null,null,null,null,null,null,11420,0]
[null,"TOTAL",{"$f":"SUM(C2602:C2608)","v":0},{"$f":"SUM(D2602:D2608)","v":0},{"$f":"SUM(E2602:E2608)","v":0},{"$f":"SUM(F2602:F2608)","v":0},0,null,null,null,null,null,null,null,null,null,null,null,null,null,null,null,null,null,null,null,0,0,0,0,0,0,0,0,0,0,345530,0]
[null,"GRUPO 27 : ATENCION ODONTOLOGICA                             ",null,null,null,null,null,null,null,null,null,null,null,null,null,null,null,null,null,null,null,null,null,{"$f":"AK2610*E2610","v":0}]
[null,"NIVEL PRIMARIO                                              "]
[2701001,"Aplicación de sellantes",{"$f":"SUM(D2612+G2612)","v":0},{"$f":"SUM(E2612:F2612)","v":0},null,null,null,null,null,null,null,null,null,null,null,null,null,null,null,null,null,null,null,null,null,null,null,null,null,null,null,null,null,null,null,null,4850,{"$f":"AK2612*E2612","v":0}]
[2701002,"Desgastes selectivos",{"$f":"SUM(D2613+G2613)","v":0},{"$f":"SUM(E2613:F2613)","v":0},null,null,null,null,null,null,null,null,null,null,null,null,null,null,null,null,null,null,null,null,null,null,null,null,null,null,null,null,null,null,null,null,3980,0]
[2701003,"Destartraje y pulido coronario",0,0,null,null,null,null,null,null,null,null,null,null,null,null,null,null,null,null,null,null,null,null,null,null,null,null,null,null,null,null,null,null,null,null,7560,0]
[2701007,"Aplicación fluoruros",0,0,null,null,null,null,null,null,null,null,null,null,null,null,null,null,null,null,null,null,null,null,null,null,null,null,null,null,null,null,null,null,null,null,2700,0]
[2701008,"Mantenedores de espacio",0,0,null,null,null,null,null,null,null,null,null,null,null,null,null,null,null,null,null,null,null,null,null,null,null,null,null,null,null,null,null,null,null,null,15790,0]
[2701011,"Pulpotomía",0,0,null,null,null,null,null,null,null,null,null,null,null,null,null,null,null,null,null,null,null,null,null,null,null,null,null,null,null,null,null,null,null,null,2770,0]
[2701013,"Examen de salud oral",0,0,null,null,null,null,null,null,null,null,null,null,null,null,null,null,null,null,null,null,null,null,null,null,null,null,null,null,null,null,null,null,null,null,3400,0]
[2701017,"Aplicación barniz de flúor",0,0,null,null,null,null,null,null,null,null,null,null,null,null,null,null,null,null,null,null,null,null,null,null,null,null,null,null,null,null,null,null,null,null,9920,0]
[2701004,"Educación grupal",0,0,null,null,null,null,null,null,null,null,null,null,null,null,null,null,null,null,null,null,null,null,null,null,null,null,null,null,null,null,null,null,null,null,10350,0]
[2701014,"Trabajo comunitario",0,0,null,null,null,null,null,null,null,null,null,null,null,null,null,null,null,null,null,null,null,null,null,null,null,null,null,null,null,null,null,null,null,null,5850,0]
[2701005,"Exodoncia simple diente permanente",0,0,null,null,null,null,null,null,null,null,null,null,null,null,null,null,null,null,null,null,null,null,null,null,null,null,null,null,null,null,null,null,null,null,4410,0]
[2701006,"Exodoncia diente primario",0,0,null,null,null,null,null,null,null,null,null,null,null,null,null,null,null,null,null,null,null,null,null,null,null,null,null,null,null,null,null,null,null,null,2770,0]
[2701009,"Obturación amalgama ",0,0,null,null,null,null,null,null,null,null,null,null,null,null,null,null,null,null,null,null,null,null,null,null,null,null,null,null,null,null,null,null,null,null,10720,0]
[2701010,"Obturación composite",0,0,null,null,null,null,null,null,null,null,null,null,null,null,null,null,null,null,null,null,null,null,null,null,null,null,null,null,null,null,null,null,null,null,10200,0]
[2701012,"Urgencias",0,0,null,null,null,null,null,null,null,null,null,null,null,null,null,null,null,null,null,null,null,null,null,null,null,null,null,null,null,null,null,null,null,null,4860,0]
[2701015,"Radiografía retroalveolar y Bite-Wing (por placa)",0,0,null,null,null,null,null,null,null,null,null,null,null,null,null,null,null,null,null,null,null,null,null,null,null,null,null,null,null,null,null,null,null,null,3100,0]
[2701016,"Obturación Vidrio Ionómero",0,0,null,null,null,null,null,null,null,null,null,null,null,null,null,null,null,null,null,null,null,null,null,null,null,null,null,null,null,null,null,null,null,null,6320,0]
[null,"TOTAL",{"$f":"SUM(C2612:C2628)","v":0},{"$f":"SUM(D2612:D2628)","v":0},0,0,0,null,null,null,null,null,null,null,null,null,null,null,null,null,null,null,null,null,null,null,0,0,0,0,0,0,0,0,0,0,109550,0]
[null,"NIVEL SECUNDARIO                                        "]
[2702001,"Cirugía bucal",{"$f":"SUM(D2631+G2631)","v":0},{"$f":"SUM(E2631:F2631)","v":0},null,null,null,null,null,null,null,null,null,null,null,null,null,null,null,null,null,null,null,null,null,null,null,null,null,null,null,null,null,null,null,null,12320,{"$f":"AK2631*E2631","v":0}]
[2702004,"Obturación Inlay metal (incluye materiales no preciosos, no incluye oro)",0,0,null,null,null,null,null,null,null,null,null,null,null,null,null,null,null,null,null,null,null,null,null,null,null,null,null,null,null,null,null,null,null,null,10530,0]
[2702005,"Consulta especialidad Periodoncia",0,0,null,null,null,null,null,null,null,null,null,null,null,null,null,null,null,null,null,null,null,null,null,null,null,null,null,null,null,null,null,null,null,null,3690,0]
[2702006,"Plano alivio oclusal",0,0,null,null,null,null,null,null,null,null,null,null,null,null,null,null,null,null,null,null,null,null,null,null,null,null,null,null,null,null,null,null,null,null,20140,0]
[2702007,"Prótesis de restitución (fase clínica)",0,0,null,null,null,null,null,null,null,null,null,null,null,null,null,null,null,null,null,null,null,null,null,null,null,null,null,null,null,null,null,null,null,null,43690,0]
[2702008,"Prótesis metálica",0,0,null,null,null,null,null,null,null,null,null,null,null,null,null,null,null,null,null,null,null,null,null,null,null,null,null,null,null,null,null,null,null,null,65650,0]
[2702009,"Radiografía extraoral (por placa)",0,0,null,null,null,null,null,null,null,null,null,null,null,null,null,null,null,null,null,null,null,null,null,null,null,null,null,null,null,null,null,null,null,null,4400,0]
[2702010,"Radiografía oclusal (por placa)",0,0,null,null,null,null,null,null,null,null,null,null,null,null,null,null,null,null,null,null,null,null,null,null,null,null,null,null,null,null,null,null,null,null,2510,0]
[2702011,"Prótesis de restitución (fase laboratorio)",0,0,null,null,null,null,null,null,null,null,null,null,null,null,null,null,null,null,null,null,null,null,null,null,null,null,null,null,null,null,null,null,null,null,21750,0]
[2702012,"Reparación compuesta de prótesis",0,0,null,null,null,null,null,null,null,null,null,null,null,null,null,null,null,null,null,null,null,null,null,null,null,null,null,null,null,null,null,null,null,null,8730,0]
[2702013,"Reparación corona",0,0,null,null,null,null,null,null,null,null,null,null,null,null,null,null,null,null,null,null,null,null,null,null,null,null,null,null,null,null,null,null,null,null,6720,0]
[2702014,"Reparación o reajuste prótesis",0,0,null,null,null,null,null,null,null,null,null,null,null,null,null,null,null,null,null,null,null,null,null,null,null,null,null,null,null,null,null,null,null,null,5260,0]
[2702015,"Restitución por corona (combinada)",0,0,null,null,null,null,null,null,null,null,null,null,null,null,null,null,null,null,null,null,null,null,null,null,null,null,null,null,null,null,null,null,null,null,39440,0]
[2702016,"Restitución por corona provisoria",0,0,null,null,null,null,null,null,null,null,null,null,null,null,null,null,null,null,null,null,null,null,null,null,null,null,null,null,null,null,null,null,null,null,20140,0]
[2702017,"Sialografía (cada lado) (incluye el proc.)",0,0,null,null,null,null,null,null,null,null,null,null,null,null,null,null,null,null,null,null,null,null,null,null,null,null,null,null,null,null,null,null,null,null,28950,0]
[2702019,"Tratamiento ortodoncia con aparatología removible  (incluye aparato)(año 1)",0,0,null,null,null,null,null,null,null,null,null,null,null,null,null,null,null,null,null,null,null,null,null,null,null,null,null,null,null,null,null,null,null,null,110640,0]
[2702020,"Tratamiento ortodoncia con aparatologia fija (incluye aparato) (año 1)",0,0,null,null,null,null,null,null,null,null,null,null,null,null,null,null,null,null,null,null,null,null,null,null,null,null,null,null,null,null,null,null,null,null,134140,0]
[2702021,"Tratamiento ortodoncia con aparatologia fija (incluye aparato) (año 2)",0,0,null,null,null,null,null,null,null,null,null,null,null,null,null,null,null,null,null,null,null,null,null,null,null,null,null,null,null,null,null,null,null,null,80110,0]
[2702022,"Endodoncia Multirradicular",0,0,null,null,null,null,null,null,null,null,null,null,null,null,null,null,null,null,null,null,null,null,null,null,null,null,null,null,null,null,null,null,null,null,69300,0]
[2702023,"Endodoncia birradicular",0,0,null,null,null,null,null,null,null,null,null,null,null,null,null,null,null,null,null,null,null,null,null,null,null,null,null,null,null,null,null,null,null,null,50650,0]
[2702024,"Endodoncia unirradicular",0,0,null,null,null,null,null,null,null,null,null,null,null,null,null,null,null,null,null,null,null,null,null,null,null,null,null,null,null,null,null,null,null,null,45310,0]
[2702025,"Telerradiografia",0,0,null,null,null,null,null,null,null,null,null,null,null,null,null,null,null,null,null,null,null,null,null,null,null,null,null,null,null,null,null,null,null,null,7710,0]
[2702026,"Radiografía panorámica u ortopantomografía",0,0,null,null,null,null,null,null,null,null,null,null,null,null,null,null,null,null,null,null,null,null,null,null,null,null,null,null,null,null,null,null,null,null,16350,0]
[2702027,"Tomografia Computacional Maxilo Facial Cone Beam",0,0,null,null,null,null,null,null,null,null,null,null,null,null,null,null,null,null,null,null,null,null,null,null,null,null,null,null,null,null,null,null,null,null,29610,0]
[null,"Total ARANCEL MAI",{"$f":"SUM(C2631:C2654)","v":0},{"$f":"SUM(D2631:D2654)","v":0},0,0,0,null,null,null,null,null,null,null,null,null,null,null,null,null,null,null,null,null,null,null,0,0,0,0,0,0,0,0,0,0,837740,0]
[null,"Sutura intraoral ",{"$f":"SUM(I2656:N2656)","v":0},null,null,null,null,{"$f":"+I2656+J2656","v":0}]
[null,"Tratamiento quirúrgico pseudoquiste y quiste odontológico ",{"$f":"SUM(I2657:N2657)","v":0},null,null,null,null,0]
[null,"Tratamiento quirúrgico tumor odontológico ",0,null,null,null,null,0]
[5099022,"Frenectomia ",0,null,null,null,null,0]
[5099023,"Fenestracion",0,null,null,null,null,0]
[5099024,"Drenaje Abceso intra-extroral",0,null,null,null,null,0]
[5099025,"Cirugía preprotesica ",0,null,null,null,null,0]
[" 5099056 ","Desobturacion de conductos ",0,null,null,null,null,0]
[null,"Cirugía ortognática",0,null,null,null,null,0]
[null,"TOTAL ARANCEL MLE Y NO ARANCELADO",{"$f":"SUM(C2656:C2664)","v":0},null,null,null,null,{"$f":"SUM(H2656:H2664)","v":0},0,0,0,0,0,0,0,0,0,0,0,0,0,0,0,0,0,0,0,0,0,0,0,0,0,0,0,0]
[null,"TOTAL PRODUCCION",{"$f":"SUM(C2655,C2665)","v":0},null,null,null,null,{"$f":"SUM(H2655,H2665)","v":0},0,0,0,0,0,0,0,0,0,0,0,0,0,0,0,0,0,0,0,0,0,0,0,0,0,0,0,0,837740,0]
[null,"NIVEL TERCIARIO                                         "]
[2703001,"Cirugía de enfermedad periodontal (por grupo)",{"$f":"SUM(I2668:N2668)","v":0},null,null,null,null,{"$f":"+I2668+J2668","v":0},null,null,null,null,null,null,null,null,null,null,null,null,null,null,null,null,null,null,null,null,null,null,null,null,null,null,null,null,13170,{"$f":"AK2668*I2668","v":0}]
[2703002,"Corticotomía",{"$f":"SUM(I2669:N2669)","v":0},null,null,null,null,0,null,null,null,null,null,null,{"$f":"SUM(P2669:Q2669)","v":0},null,null,{"$f":"SUM(S2669:T2669)","v":0},null,null,{"$f":"SUM(V2669:W2669)","v":0},null,null,{"$f":"SUM(Y2669:Z2669)","v":0},null,null,null,null,null,null,null,null,null,null,null,null,73020,0]
[2703003,"Disyunción palatina quirúrgica",{"$f":"SUM(I2670:N2670)","v":0},null,null,null,null,0,null,null,null,null,null,null,{"$f":"SUM(P2670:Q2670)","v":0},null,null,{"$f":"SUM(S2670:T2670)","v":0},null,null,{"$f":"SUM(V2670:W2670)","v":0},null,null,{"$f":"SUM(Y2670:Z2670)","v":0},null,null,null,null,null,null,null,null,null,null,null,null,136160,0]
[2703004,"Extirpación de pseudoquistes, quistes y tumores",0,null,null,null,null,0,null,null,null,null,null,null,{"$f":"SUM(P2671:Q2671)","v":0},null,null,{"$f":"SUM(S2671:T2671)","v":0},null,null,0,null,null,0,null,null,null,null,null,null,null,null,null,null,null,null,102300,0]
[2703005,"Glosectomías",0,null,null,null,null,0,null,null,null,null,null,null,0,null,null,0,null,null,0,null,null,0,null,null,null,null,null,null,null,null,null,null,null,null,156580,0]
[2703006,"Implante endodóntico intraóseo",0,null,null,null,null,0,null,null,null,null,null,null,null,null,null,null,null,null,null,null,null,null,null,null,null,null,null,null,null,null,null,null,null,null,41530,0]
[2703007,"Implantes subperiósticos",0,null,null,null,null,0,null,null,null,null,null,null,0,null,null,0,null,null,0,null,null,0,null,null,null,null,null,null,null,null,null,null,null,null,157430,0]
[2703008,"Exodoncia de dientes retenidos",0,null,null,null,null,0,null,null,null,null,null,null,null,null,null,null,null,null,null,null,null,null,null,null,null,null,null,null,null,null,null,null,null,null,33700,0]
[2703009,"Injertos en boca",0,null,null,null,null,0,null,null,null,null,null,null,0,null,null,0,null,null,0,null,null,0,null,null,null,null,null,null,null,null,null,null,null,null,136160,0]
[2703010,"Elevación de piso del seno maxilar",0,null,null,null,null,0,null,null,null,null,null,null,0,null,null,0,null,null,0,null,null,0,null,null,null,null,null,null,null,null,null,null,null,null,118560,0]
[2703011,"Plastía de fístula salival",0,null,null,null,null,0,null,null,null,null,null,null,null,null,null,null,null,null,null,null,null,null,null,null,null,null,null,null,null,null,null,null,null,null,47010,0]
[2703012,"Preparación quirúrgica de los maxilares con fines protésicos",0,null,null,null,null,0,null,null,null,null,null,null,null,null,null,null,null,null,null,null,null,null,null,null,null,null,null,null,null,null,null,null,null,null,31160,0]
[2703013,"Profundización de vestíbulo o reconstrucción de rebordes, con o sin injerto",0,null,null,null,null,0,null,null,null,null,null,null,0,null,null,0,null,null,0,null,null,0,null,null,null,null,null,null,null,null,null,null,null,null,149940,0]
[2703014,"Reimplante y trasplante dentario",0,null,null,null,null,0,null,null,null,null,null,null,null,null,null,null,null,null,null,null,null,null,null,null,null,null,null,null,null,null,null,null,null,null,33700,0]
[2703015,"Remoción de cuerpo extraño y secuestrectomía",0,null,null,null,null,0,null,null,null,null,null,null,null,null,null,null,null,null,null,null,null,null,null,null,null,null,null,null,null,null,null,null,null,null,33700,0]
[2703016,"Sutura completa de herida mayor",0,null,null,null,null,0,null,null,null,null,null,null,null,null,null,null,null,null,null,null,null,null,null,null,null,null,null,null,null,null,null,null,null,null,64360,0]
[2703017,"Sutura completa de herida menor",0,null,null,null,null,0,null,null,null,null,null,null,null,null,null,null,null,null,null,null,null,null,null,null,null,null,null,null,null,null,null,null,null,null,55950,0]
[2703018,"Sutura simple de herida",0,null,null,null,null,0,null,null,null,null,null,null,null,null,null,null,null,null,null,null,null,null,null,null,null,null,null,null,null,null,null,null,null,null,33700,0]
[2703019,"Tratamiento quirúrgico fracturas maxilar superior",0,null,null,null,null,0,null,null,null,null,null,null,0,null,null,0,null,null,0,null,null,0,null,null,null,null,null,null,null,null,null,null,null,null,179350,0]
[2703020,"Tratamiento quirúrgico de fracturas en maxilar inferior",0,null,null,null,null,0,null,null,null,null,null,null,0,null,null,0,null,null,0,null,null,0,null,null,null,null,null,null,null,null,null,null,null,null,179350,0]
[2703021,"Tratamiento de traumatismo dento alveolar simple",{"$f":"SUM(E2688:G2688)","v":0},{"$f":"SUM(E2688:F2688)","v":0},null,null,null,null,null,null,null,null,null,null,null,null,null,null,null,null,null,null,null,null,null,null,null,null,null,null,null,null,null,null,null,null,33700,0]
[2703022,"Tratamiento de traumatismo dento alveolar complejo",{"$f":"SUM(E2689:G2689)","v":0},0,null,null,null,null,null,null,null,null,null,null,null,null,null,null,null,null,null,null,null,null,null,null,null,null,null,null,null,null,null,null,null,null,61990,0]
[2703023,"Implante oseointegrado",0,null,null,null,null,0,null,null,null,null,null,null,0,null,null,0,null,null,0,null,null,0,null,null,null,null,null,null,null,null,null,null,null,null,70120,0]
[2703024,"Pilar Protésico sobre Implantes",0,null,null,null,null,0,null,null,null,null,null,null,0,null,null,0,null,null,0,null,null,0,null,null,null,null,null,null,null,null,null,null,null,null,31990,0]
[null,"TOTAL",{"$f":"SUM(C2668:C2691)","v":0},{"$f":"SUM(D2668:D2691)","v":0},0,0,0,{"$f":"SUM(H2668:H2691)","v":0},0,0,0,0,0,0,0,0,0,0,0,0,0,0,0,0,0,0,0,0,0,0,0,0,0,0,0,0,1974630,0]
[null,"Otras prestaciones odontológicas"]
[5099026,"Bloqueo Anestesico",{"$f":"SUM(D2694+G2694)","v":0},{"$f":"SUM(E2694:F2694)","v":0}]
[null,"Odontologia general",0,0]
[5099028,"Actividad interseptiva de anomalias dentomaxilares OPI",0,0]
[5099029,"Instalacion de aparato intercepcion de anomalias dentomaxilares",0,0]
[5099030,"Examen diagnostico OPI",0,0]
[5099031,"Alta mantencion ",0,0]
[null,"Odontopediatria",0,0]
[5099032,"Corona metalica",{"$f":"SUM(D2701+G2701)","v":0},{"$f":"SUM(E2701:F2701)","v":0}]
[null,"Atención de niño discapacitado en sillón (acción de odontopediatría)",0,0]
[null,"Atención de niño discapacitado en pabellón (acción de odontopediatría)",0,0]
[null,"Ortodoncia",0,0]
[5099033,"Instalacion aparato removible ",0,0]
[5099034,"Instalacion aparato ortopedia prequirurgica (fisura labiopalatina)",0,0]
[5099035,"Ortopedia prequirurgica actividad (fisura labiopalatina)",0,0]
[null,"Instalación Aparato Fijo en Ortodoncia. (Brackets)",0,0]
[null,"Endodoncia",0,0]
[5099036,"Tratamiento de induccion al cierre",0,0]
[5099037,"Desobturacion de conductos",0,0]
[null,"Medicación intraconducto (acción de endodoncia)",0,0]
[null,"Periodoncia",0,0]
[5099038,"Terapia articular especifica",0,0]
[null,"Férula Periodoncia",0,0]
[null,"Radiologia",0,0]
[5099041,"Telerradiografia perfil",0,0]
[5099042,"Telerradiografia frente",0,0]
[5099043,"Radiografia articulacion temporo mandibular",0,0]
[null,"Protesis",0,0]
[5099057,"instalacion aparotologia fija",0,0]
[5099058,"instalacion protesis removible",0,0]
[null,"Prótesis Removible Acrílica",0,0]
[null,"Prótesis Removible Metálica",0,0]
[null,"Instalación Aparato de Contención. ",0,0]
[null,"Reparación de Prótesis. ",0,0]
[null,"Prótesis Fija Provisoria (unitaria o Plural)",0,0]
[null,"Tratamiento Traumatismo Dentoalveolar ",0,0]
[null,"Instalación de Implante Endo-Oseo Oseointegrable. ",0,0]
[null,"Tratamiento Temporo Mandibular ",0,0]
[null,"Prevención odontológica niño discapacitado ",0,0]
[null,"Tratamiento aparatología fija niños de 12 a 14 años año 1 ",0,0]
[null,"Tratamiento aparatología fija niños de 12 a 14 años año 2 ",0,0]
[null,"Obturaciones de vidrio Ionomero en diente temporal",0,0]
[null,"Destartraje subgingival y Pulido radicular por Sextante",0,0]
[null,"Desinfección Bucal Total",0,0]
[null,"Traumatologia Maxilofacial",0,0]
[5099059,"Examen y diagnostico ttm eje I  ",0,0]
[5099060,"Examen y diagnostico ttm eje I y II montaje",0,0]
[null,"Trastornos Temporomandibular y dolor orofacial",0,0]
[5099039,"Terapia cognitiva conductual y autocontrol TTM (trastornos temporomandibulares)",0,0]
[null,"TOTAL",{"$f":"SUM(C2694:C2741)","v":0},{"$f":"SUM(D2694:D2741)","v":0},0,0,0,null,null,null,null,null,null,null,null,null,null,null,null,null,null,null,null,null,null,null,0,0,0,0,0,0,0,0,0,0]
[null,"GRUPO 30 : LENTES,AUDIFONOS"]
[null,"LENTES Y AUDIFONOS                                          "]
[3001001,"Lentes ópticos",0,0,null,null,null,null,null,null,null,null,null,null,null,null,null,null,null,null,null,null,null,null,null,null,null,null,null,null,null,null,null,null,null,null,21270,{"$f":"AK2745*E2745","v":0}]
[3001002,"Audífonos",0,0,null,null,null,null,null,null,null,null,null,null,null,null,null,null,null,null,null,null,null,null,null,null,null,null,null,null,null,null,null,null,null,null,266550,{"$f":"AK2746*E2746","v":0}]
[null,"TOTAL",{"$f":"SUM(C2745:C2746)","v":0},{"$f":"SUM(D2745:D2746)","v":0},0,0,0,null,null,null,null,null,null,null,null,null,null,null,null,null,null,null,null,null,null,null,0,0,0,0,0,0,0,0,0,0,287820,0]
[null,"PROGRAMA NACIONAL DE DROGAS                              "]
[3002001,"Linfoma de Hodgkin",0,0,null,null,null,null,null,null,null,null,null,null,null,null,null,null,null,null,null,null,null,null,null,null,null,null,null,null,null,null,null,null,null,null,272260,{"$f":"AK2749*E2749","v":0}]
[3002002,"Linfoma No Hodgkin no agresivo",0,0,null,null,null,null,null,null,null,null,null,null,null,null,null,null,null,null,null,null,null,null,null,null,null,null,null,null,null,null,null,null,null,null,38680,0]
[3002003,"Linfoma No Hodgkin Intermedio",0,0,null,null,null,null,null,null,null,null,null,null,null,null,null,null,null,null,null,null,null,null,null,null,null,null,null,null,null,null,null,null,null,null,145940,0]
[3002004,"Linfoma No Hodgkin, agresivo",0,0,null,null,null,null,null,null,null,null,null,null,null,null,null,null,null,null,null,null,null,null,null,null,null,null,null,null,null,null,null,null,null,null,145940,0]
[3002005,"Leucemia linfoblastica",0,0,null,null,null,null,null,null,null,null,null,null,null,null,null,null,null,null,null,null,null,null,null,null,null,null,null,null,null,null,null,null,null,null,265680,0]
[3002006,"Leucemia Aguda No linfática aguda y Leucemia Promielocítica",0,0,null,null,null,null,null,null,null,null,null,null,null,null,null,null,null,null,null,null,null,null,null,null,null,null,null,null,null,null,null,null,null,null,407720,0]
[3002007,"Cáncer de Testículo y  Germinales extragonadales",0,0,null,null,null,null,null,null,null,null,null,null,null,null,null,null,null,null,null,null,null,null,null,null,null,null,null,null,null,null,null,null,null,null,695540,0]
[3002008,"Enfermedad Trofoblástica Gestacional",0,0,null,null,null,null,null,null,null,null,null,null,null,null,null,null,null,null,null,null,null,null,null,null,null,null,null,null,null,null,null,null,null,null,144870,0]
[3002033,"Rescate de Linfomas y Leucemias",0,0,null,null,null,null,null,null,null,null,null,null,null,null,null,null,null,null,null,null,null,null,null,null,null,null,null,null,null,null,null,null,null,null,390450,0]
[3002034,"Cáncer de mama etapa I y II",0,0,null,null,null,null,null,null,null,null,null,null,null,null,null,null,null,null,null,null,null,null,null,null,null,null,null,null,null,null,null,null,null,null,164400,0]
[3002135,"Cáncer de mama etapa III",0,0,null,null,null,null,null,null,null,null,null,null,null,null,null,null,null,null,null,null,null,null,null,null,null,null,null,null,null,null,null,null,null,null,142860,0]
[3002136,"Cáncer de mama etapa IV",0,0,null,null,null,null,null,null,null,null,null,null,null,null,null,null,null,null,null,null,null,null,null,null,null,null,null,null,null,null,null,null,null,null,217200,0]
[3002137,"Cáncer de mama etapa IV metástasis ósea",0,0,null,null,null,null,null,null,null,null,null,null,null,null,null,null,null,null,null,null,null,null,null,null,null,null,null,null,null,null,null,null,null,null,57150,0]
[3002036,"Cáncer cervico uterino ",0,0,null,null,null,null,null,null,null,null,null,null,null,null,null,null,null,null,null,null,null,null,null,null,null,null,null,null,null,null,null,null,null,null,42710,0]
[3002009,"Linfoma de Hodgkin",0,0,null,null,null,null,null,null,null,null,null,null,null,null,null,null,null,null,null,null,null,null,null,null,null,null,null,null,null,null,null,null,null,null,234230,0]
[3002010,"Linfoma B y LLA-B",{"$f":"SUM(D2764+G2764)","v":0},{"$f":"SUM(E2764:F2764)","v":0},null,null,null,null,null,null,null,null,null,null,null,null,null,null,null,null,null,null,null,null,null,null,null,null,null,null,null,null,null,null,null,null,1393350,0]
[3002011,"Linfoma Linfoblástico",0,0,null,null,null,null,null,null,null,null,null,null,null,null,null,null,null,null,null,null,null,null,null,null,null,null,null,null,null,null,null,null,null,null,210220,0]
[3002012,"Leucemia linfoblástica aguda",0,0,null,null,null,null,null,null,null,null,null,null,null,null,null,null,null,null,null,null,null,null,null,null,null,null,null,null,null,null,null,null,null,null,185900,0]
[3002013,"Leucemia Mieloide Aguda",0,0,null,null,null,null,null,null,null,null,null,null,null,null,null,null,null,null,null,null,null,null,null,null,null,null,null,null,null,null,null,null,null,null,377380,0]
[3002014,"Neuroblastoma",0,0,null,null,null,null,null,null,null,null,null,null,null,null,null,null,null,null,null,null,null,null,null,null,null,null,null,null,null,null,null,null,null,null,1254930,0]
[3002015,"Osteosarcoma",0,0,null,null,null,null,null,null,null,null,null,null,null,null,null,null,null,null,null,null,null,null,null,null,null,null,null,null,null,null,null,null,null,null,1289650,0]
[3002016,"Sarcoma partes blandas",0,0,null,null,null,null,null,null,null,null,null,null,null,null,null,null,null,null,null,null,null,null,null,null,null,null,null,null,null,null,null,null,null,null,1021120,0]
[3002017,"Ewing",0,0,null,null,null,null,null,null,null,null,null,null,null,null,null,null,null,null,null,null,null,null,null,null,null,null,null,null,null,null,null,null,null,null,1076160,0]
[3002107,"Tumores germinales Extra Sistema Nerviso Central (Extra SNC)",0,0,null,null,null,null,null,null,null,null,null,null,null,null,null,null,null,null,null,null,null,null,null,null,null,null,null,null,null,null,null,null,null,null,424550,0]
[3002020,"Tumor de Wilms",0,0,null,null,null,null,null,null,null,null,null,null,null,null,null,null,null,null,null,null,null,null,null,null,null,null,null,null,null,null,null,null,null,null,101670,0]
[3002021,"Retinoblastoma",0,0,null,null,null,null,null,null,null,null,null,null,null,null,null,null,null,null,null,null,null,null,null,null,null,null,null,null,null,null,null,null,null,null,303320,0]
[3002022,"Histiocitosis",0,0,null,null,null,null,null,null,null,null,null,null,null,null,null,null,null,null,null,null,null,null,null,null,null,null,null,null,null,null,null,null,null,null,85770,0]
[3002024,"Recaída tumores sólidos",0,0,null,null,null,null,null,null,null,null,null,null,null,null,null,null,null,null,null,null,null,null,null,null,null,null,null,null,null,null,null,null,null,null,1473700,0]
[3002025,"Hepatoblastomas",0,0,null,null,null,null,null,null,null,null,null,null,null,null,null,null,null,null,null,null,null,null,null,null,null,null,null,null,null,null,null,null,null,null,344590,0]
[3002026,"Leucemias mieloide crónica",0,0,null,null,null,null,null,null,null,null,null,null,null,null,null,null,null,null,null,null,null,null,null,null,null,null,null,null,null,null,null,null,null,null,1154370,0]
[3002126,"Recidiva de Leucemia Mieloide",0,0,null,null,null,null,null,null,null,null,null,null,null,null,null,null,null,null,null,null,null,null,null,null,null,null,null,null,null,null,null,null,null,null,706700,0]
[3002027,"Recidiva de leucemias Linfoblasticas",0,0,null,null,null,null,null,null,null,null,null,null,null,null,null,null,null,null,null,null,null,null,null,null,null,null,null,null,null,null,null,null,null,null,576720,0]
[3002028,"Méduloblastomas",0,0,null,null,null,null,null,null,null,null,null,null,null,null,null,null,null,null,null,null,null,null,null,null,null,null,null,null,null,null,null,null,null,null,310880,0]
[3002029,"Tumores en < de 3 años",0,0,null,null,null,null,null,null,null,null,null,null,null,null,null,null,null,null,null,null,null,null,null,null,null,null,null,null,null,null,null,null,null,null,181250,0]
[3002030,"Glioma",0,0,null,null,null,null,null,null,null,null,null,null,null,null,null,null,null,null,null,null,null,null,null,null,null,null,null,null,null,null,null,null,null,null,437960,0]
[3002031,"Astrocitoma",0,0,null,null,null,null,null,null,null,null,null,null,null,null,null,null,null,null,null,null,null,null,null,null,null,null,null,null,null,null,null,null,null,null,453850,0]
[3002032,"Tumor Germinal SNC",0,0,null,null,null,null,null,null,null,null,null,null,null,null,null,null,null,null,null,null,null,null,null,null,null,null,null,null,null,null,null,null,null,null,283600,0]
[3002023,"Cuidados Paliativos y Alivio del Dolor en Cáncer Terminal (en adultos o niños)",0,0,null,null,null,null,null,null,null,null,null,null,null,null,null,null,null,null,null,null,null,null,null,null,null,null,null,null,null,null,null,null,null,null,38560,0]
[null,"TOTAL",{"$f":"SUM(C2749:C2786)","v":0},{"$f":"SUM(D2749:D2786)","v":0},0,0,0,null,null,null,null,null,null,null,null,null,null,null,null,null,null,null,null,null,null,null,0,0,0,0,0,0,0,0,0,0,17051830,0]
[null,"Programa cáncer"]
[null,"Test Inmunoquímico de Deposiciones",0,0]
[null,"Yodoterapia",0,0]
[null,"Braquiterapia alta tasa en dosis (HDR)",0,0]
[null,"Braquiterapia baja tasa en dosis (LDR)",0,0]
[null,"Teleterapia de alta complejidad con acelerador lineal (3D)",0,0]
[null,"Teleterapia estándar (3D) con acelerador lineal ",0,0]
[null,"Telecobaltoterapia con acelerador lineal",0,0]
[null,"TOTAL",{"$f":"SUM(C2789:C2795)","v":0},{"$f":"SUM(D2789:D2795)","v":0},0,0,0,null,null,null,null,null,null,null,null,null,null,null,null,null,null,null,null,null,null,null,0,0,0,0,0,0,0,0,0,0]
[null,"OTROS"]
[3002037,"Recidiva cáncer cervicouterino ",0,0]
[3002040,"Cáncer colon recidiva ",0,0]
[3002042,"Cáncer anal ",0,0]
[3002134,"Cáncer rectal ",0,0]
[3002160,"Mieloma múltiple ",0,0]
[3002205,"Leucemia linfoblástica crónica",0,0]
[3002234,"Cáncer colon   ",0,0]
[3002401,"Cáncer gástrico pre-operatorio  ",0,0]
[3002402,"Cáncer gástrico post-operatorio ",0,0]
[3102136,"Cáncer ovario epitelial ",0,0]
[3102138,"Cáncer ovario recurrente resistente a platino ",0,0]
[3104002,"Mama hormonoterapia ",0,0]
[3106002,"Hormonoterapia  reemplazo ",0,0]
[3106102,"Cáncer próstata ",0,0]
[3201137,"Cáncer vesical ",0,0]
[8014001,"Cáncer mama trastuzumab",0,0]
[null,"Quimioterapia Intervencional",0,0]
[null,"Quimioterapia Intratecal",0,0]
[null,"TOTAL",{"$f":"SUM(C2798:C2815)","v":0},{"$f":"SUM(D2798:D2815)","v":0},0,0,0,null,null,null,null,null,null,null,null,null,null,null,null,null,null,null,null,null,null,null,0,0,0,0,0,0,0,0,0,0]
[null,"TRATAMIENTO ABREVIADO DE LA TUBERCULOSIS     "]
[3003001,"TBC, esquema primario (mensual)",0,0,null,null,null,null,null,null,null,null,null,null,null,null,null,null,null,null,null,null,null,null,null,null,null,null,null,null,null,null,null,null,null,null,7590,{"$f":"AK2818*E2818","v":0}]
[3003002,"TBC, esquema primario simplificado (mensual)",0,0,null,null,null,null,null,null,null,null,null,null,null,null,null,null,null,null,null,null,null,null,null,null,null,null,null,null,null,null,null,null,null,null,4040,{"$f":"AK2819*E2819","v":0}]
[3003003,"TBC, esquema secundario (mensual)",0,0,null,null,null,null,null,null,null,null,null,null,null,null,null,null,null,null,null,null,null,null,null,null,null,null,null,null,null,null,null,null,null,null,15220,{"$f":"AK2820*E2820","v":0}]
[3003004,"TBC, esquema normado de retratamiento (mensual)",0,0,null,null,null,null,null,null,null,null,null,null,null,null,null,null,null,null,null,null,null,null,null,null,null,null,null,null,null,null,null,null,null,null,156140,{"$f":"AK2821*E2821","v":0}]
[3003005,"TBC, esquema especial de retratamiento (mensual)",0,0,null,null,null,null,null,null,null,null,null,null,null,null,null,null,null,null,null,null,null,null,null,null,null,null,null,null,null,null,null,null,null,null,857590,{"$f":"AK2822*E2822","v":0}]
[null,"TOTAL",{"$f":"SUM(C2818:C2822)","v":0},{"$f":"SUM(D2818:D2822)","v":0},0,0,0,null,null,null,null,null,null,null,null,null,null,null,null,null,null,null,null,null,null,null,0,0,0,0,0,0,0,0,0,0,1040580,0]
[null,"Otros Exámenes  de Laboratorio"]
[5099117,"Carga viral Hepatitis B por técnica de PCR",0,0]
[5099118,"Carga Viral Hepatitis C por técnica de PCR",0,0]
[5099119,"Carga Viral VIH por técnica de PCR",0,0]
[5099120,"PCR detección y genotipo Virus papiloma huma (HPV)",0,0]
[5099121,"PCR Traslocación t(9:22) cromosoma Filadelfia",0,0]
[5099122,"PCR Traslocación t(15:17) gen de fusión PML-RARA",0,0]
[5099123,"PCR Bordetella Pertussis",0,0]
[5099124,"PCR Mycoplasma",{"$f":"SUM(D2832+G2832)","v":0},{"$f":"SUM(E2832:F2832)","v":0}]
[5099125,"PCR Chlamydia",0,0]
[5099126,"PCR Clostridium difficile",0,0]
[5099127,"PCR otros virus respiratorios: Metaneumovirus, Bocavirus, VRS, Coronavirus, Enterovirus, Parainfluenza A, Parainfluenza B, Rhinovirus, Adenovirus. ",0,0]
[5099128,"Detección genes BRCA1 y BRCA2 (cáncer de mamas)",0,0]
[5099129,"Determinación Toxina Clostridium difficile",0,0]
[5099130,"Virus HANTA (Técnica de PCR)",0,0]
[5099131,"Virus HANTA (Detección de IgM))",0,0]
[5099132,"HELICOBACTER PILORY (test de ureasa)",0,0]
[5099133,"Anticuerpos anti Helicobacter pylori",0,0]
[5099134,"Bartonella (Anticuerpos IgG e IgM)",0,0]
[5099135,"SEROTIPICACION (ESCHERICHIA COLI, SALMONELLA, SHIGELLA)",0,0]
[5099136,"BORDETELLA POR  Inmunofluorescencia",0,0]
[5099137,"Prealbúmina",0,0]
[5099138,"Mioglobina",0,0]
[5099139,"NT-proBNP",0,0]
[5099140,"Procalcitonina",0,0]
[5099141,"Aminoácidos en sangre",0,0]
[5099142,"Plomo ",0,0]
[5099143,"Oxalatos en orina",0,0]
[5099144,"Citratos en orina",0,0]
[5099146,"Viscosidad sanguínea",0,0]
[5099147,"INR capilar por técnica electroquímica",0,0]
[5099148,"Péptido C",0,0]
[5099149,"Anticuerpos antiendomiso",0,0]
[5099150,"Anticuerpos antigliadina",0,0]
[5099151,"MIELOPEROXIDASA (MPO)",0,0]
[5099152,"PROTEINASA (PR3)",0,0]
[5099153,"ANTI-B2 GLICOPROTEINA I IgG",0,0]
[5099154,"ANTIC. ANTI PEROXIDASA",0,0]
[5099155,"OXCARBAZEPINA",0,0]
[5099156,"COCAINA-MARIHUANA-ANFETAMINAS c/u",0,0]
[5099157,"ANT.ANTIPEPTIDO CITRULINADO",0,0]
[5099158,"Calcitonina",0,0]
[5099159,"Enolasa (NSE)",0,0]
[5099160,"Antígeno inhibidor del melanoma (MIA)",0,0]
[5099161,"Antígeno asociado a los carcinomas escamosos (SCCA- y SSCA-2)",0,0]
[5099162,"CYFRA  21.1",0,0]
[5099163,"HER-2/neu",0,0]
[5099164,"He4 Proteína 4 Del Epididimo Humano",0,0]
[5099165,"Ki65",0,0]
[5099166,"TAG-72 Glicoproteína 72 asociada a tumores",0,0]
[5099167,"TRAB.=ANTIC.ANTIRECEPTOR TSH",0,0]
[5099168,"ANTI-B2 GLICOPROTEINA I IgM",0,0]
[5099169,"Dímero D",0,0]
[5099170,"Marcadores inmunológicos en Diabetes (anticuerpo anti-islote pancreatico: ICA, Ac. Antiinsulina, Antic. Antidecarboxilasa del ác. Glutamico,  Antic. Anti ICA512",0,0]
[5099171,"Parvovirus B19 IgG, Ig M",0,0]
[5099172,"PCR parvovirus B19",0,0]
[5099173,"Metanefrinas (plasmáticas y urinarias)",0,0]
[5099174,"Antígeno prostático Libre",0,0]
[5099175,"Anticuerpos antifosfolípidos",0,0]
[5099176,"Anticuerpos antiplaquetarios",0,0]
[5099177,"Homocysteina total ",0,0]
[5099178,"Anticuerpo antiproteína P ribosomal",0,0]
[5099179,"Antifungigrama para levaduras",0,0]
[5099180,"Anticuerpo antineumococo",0,0]
[5099181,"Anticuerpo antisaccharomyces cerevisiae (ASCA)",0,0]
[5099182,"Antigeno Urinario para Legionella y Neumococo",0,0]
[5099183,"Triptasa serica",0,0]
[5099184,"Test de nugent (cortisol serico post dexametasona)",0,0]
[5099185,"PCR Toxoplasmosis",0,0]
[5099186,"PCR Streptococcus Agalactiae",0,0]
[5099187,"Arilsulfatasa (A y B)",0,0]
[5099188,"Hexosaminidasa  (A y B)",{"$f":"SUM(D2895+G2895)","v":0},{"$f":"SUM(E2895:F2895)","v":0}]
[5099189,"Hexosaminidasa  Total",0,0]
[null,"Cobre orina",0,0]
[null,"Dihidrotestosterona",0,0]
[null,"Factor II protrombina 20210 G>A, mutación",0,0]
[null,"Factor V Leiden, mutación",0,0]
[null,"Oxalato sangre",0,0]
[null,"Hepatitis B, detección por PCR-RT",0,0]
[null,"Pneumocystis Jirovecii (carinii) por PCR-RT",0,0]
[null,"Neisseria gonorrhoeae por PCR-RT",0,0]
[null,"Virus papiloma humano PCR",0,0]
[null,"Bordetella parapertussis por PCR-RT",0,0]
[null,"Streptococcus grupo B (Agalactiae) por PCR-RT",0,0]
[null,"Mycobacterium tuberculosis por PCR-RT",0,0]
[null,"Toxoplasmosis Gondii por PCR-RT",0,0]
[null,"Zinc en sangre",0,0]
[null,"Zinc en orina",0,0]
[null,"Quimico de líquido ascítico",0,0]
[null,"Quimico en líquido cefalorraquídeo",0,0]
[null,"Translocación t(9;22) bcr/abl p210, diagnóstico",0,0]
[null,"Translocacion t(9;22) bcr/abl p190, diagnóstico",0,0]
[null,"Translocación t(15;17) pml/rara, diagnóstico",0,0]
[null,"Translocacion t(12;21) tel- aml1, diagnóstico",0,0]
[null,"Translocación t(8;21) aml1/eto, diagnóstico",0,0]
[null,"Translocacion inv(16) cbfb-myh11, diagnóstico",0,0]
[null,"Translocación t(4;11) mll/af4, diagnóstico  ",0,0]
[null,"Translocación t(1;19) e2a/pbx-1,diagnóstico   ",0,0]
[null,"Mutación jak-2 (v617f)",0,0]
[null,"Mutación flt3-itd",0,0]
[null,"Mutación a del exón 12 de npm1",0,0]
[null,"Mutación t315i",0,0]
[null,"Translocación t(9;22) bcr/abl p210, seguimiento, cuantitativa",0,0]
[null,"5-hiaa urinario 24 horas con creatinina ",0,0]
[null,"Peptido Natriurético Tipo B  ( PRO-BNP)",0,0]
[null,"Peptido c basal",0,0]
[null,"Cortisol post acth",0,0]
[null,"Cortisol post dexametasona",0,0]
[null,"Cortisol salival",0,0]
[null,"Indice androgénico libre",0,0]
[null,"Pneumocystis jiroveci en lavado bronco alveolar",0,0]
[null,"Elispot para tbc",0,0]
[null,"Galactomanano",0,0]
[null,"Serologia bartonella ",0,0]
[null,"Pre albumina ",0,0]
[null,"Toxina clostridium difficile",0,0]
[null,"Cromosoma 22",0,0]
[null,"Cartridge para Troponina",0,0]
[null,"Cartridge Multiple",0,0]
[null,"TOTAL",{"$f":"SUM(C2825:C2940)","v":0},{"$f":"SUM(D2825:D2940)","v":0},{"$f":"SUM(E2825:E2940)","v":0},{"$f":"SUM(F2825:F2940)","v":0},{"$f":"SUM(G2825:G2940)","v":0},null,null,null,null,null,null,null,null,null,null,null,null,null,null,null,null,null,null,null,{"$f":"SUM(AA2825:AA2940)","v":0},{"$f":"SUM(AB2825:AB2940)","v":0},{"$f":"SUM(AC2825:AC2940)","v":0},{"$f":"SUM(AD2825:AD2940)","v":0},0,0,0,0,0,0]

{"sheet":"B17","index":2,"n_rows":541,"n_cols":28,"rows_kept":541,"cut":false,"hidden":false,"merged":[[494,0,494,1],[488,0,488,1],[489,0,489,1],[490,0,490,1],[491,0,491,1],[492,0,492,1],[497,6,497,8],[523,0,523,1],[497,4,497,5],[497,0,498,1],[497,2,498,2],[497,3,498,3],[502,0,502,1],[503,0,503,1],[509,0,509,1],[510,0,510,1],[499,0,499,1],[500,0,500,1],[501,0,501,1],[521,0,521,1],[514,0,514,1],[518,0,518,1],[519,0,519,1],[520,0,520,1],[471,9,472,9],[419,0,419,1],[373,9,374,9],[484,0,484,1],[482,0,482,1],[483,0,483,1],[473,0,473,1],[471,0,472,1],[474,0,474,1],[459,0,459,1],[460,0,460,1],[461,0,461,1],[469,0,469,1],[417,3,418,3],[477,0,477,1],[478,0,480,0],[421,0,421,1],[410,4,411,4],[414,0,415,0],[413,0,413,1],[455,0,455,1],[456,0,456,1],[457,0,457,1],[422,2,424,2],[475,0,475,1],[423,7,424,7],[471,2,472,2],[471,3,471,8],[417,0,418,1],[417,2,418,2],[425,0,427,0],[446,0,448,0],[467,0,468,0],[420,0,420,1],[432,0,434,0],[435,0,437,0],[442,0,444,0],[464,0,464,1],[451,0,451,1],[452,0,452,1],[422,0,424,1],[458,0,458,1],[439,0,441,0],[463,0,463,1],[7,0,7,2],[87,0,87,1],[265,0,265,1],[327,0,329,1],[327,3,327,6],[79,0,82,0],[220,0,220,1],[204,0,205,0],[275,0,275,1],[327,2,329,2],[328,4,328,5],[72,0,72,1],[73,0,73,1],[98,0,98,4],[328,3,329,3],[126,0,126,1],[91,0,94,0],[328,6,329,6],[327,16,329,16],[328,7,329,7],[328,8,329,8],[328,9,329,9],[327,7,327,9],[328,10,329,10],[328,11,329,11],[373,15,374,15],[328,14,329,14],[328,15,329,15],[327,13,329,13],[327,14,327,15],[357,13,359,13],[357,14,357,15],[372,13,374,13],[372,14,372,15],[327,10,327,12],[328,12,329,12],[373,7,374,7],[373,8,374,8],[357,16,359,16],[358,15,359,15],[358,14,359,14],[358,11,359,11],[385,17,387,17],[373,14,374,14],[409,0,409,5],[385,14,387,14],[385,15,386,16],[410,2,411,2],[373,12,374,12],[385,3,387,3],[373,4,373,5],[372,2,374,2],[373,6,374,6],[372,3,372,6],[385,11,386,13],[372,10,372,12],[373,11,374,11],[410,0,411,1],[385,0,387,1],[372,7,372,9],[384,0,384,1],[385,4,385,9],[422,16,424,16],[423,3,424,3],[423,4,423,5],[423,6,424,6],[386,4,386,6],[386,7,386,9],[385,10,387,10],[372,16,374,16],[423,11,424,11],[423,12,424,12],[423,14,424,14],[422,7,422,9],[422,10,422,12],[422,3,422,6],[423,15,424,15],[423,9,424,9],[423,10,424,10],[423,8,424,8],[410,3,411,3],[410,5,411,5],[373,10,374,10],[422,13,424,13],[422,14,422,15],[373,3,374,3],[357,2,359,2],[358,9,359,9],[372,0,374,1],[383,0,383,1],[385,2,387,2],[358,12,359,12],[357,0,359,1],[357,7,357,9],[358,3,359,3],[358,4,358,5],[358,6,359,6],[358,7,359,7],[358,8,359,8],[357,3,357,6],[358,10,359,10],[357,10,357,12],[416,0,416,1],[453,0,453,1],[454,0,454,1],[281,0,281,1],[288,0,288,1],[300,0,300,1],[412,0,412,1],[408,0,408,1],[330,0,330,1],[344,0,344,1],[362,0,362,1],[363,0,363,1],[355,0,355,1],[336,0,339,0],[348,0,351,0],[365,0,365,1],[368,0,368,1],[369,0,369,1],[370,0,370,1],[367,0,367,1],[354,0,354,1],[450,0,450,1],[487,0,487,1],[533,0,533,1],[534,0,534,1],[535,0,535,1],[538,0,538,1],[505,0,505,1],[506,0,506,1],[507,0,507,1],[508,0,508,1],[511,0,511,1],[512,0,512,1],[515,0,515,1],[516,0,516,1],[526,0,526,1],[527,0,527,1],[528,0,528,1],[529,0,529,1],[530,0,530,1],[522,0,522,1],[531,0,531,1],[536,0,536,1],[537,0,537,1],[493,0,493,1],[524,0,524,1]]}
["SERVICIO DE SALUD / ESTABLECIMIENTO MUNICIPAL"]
[{"$f":"CONCATENATE(\"COMUNA: \",NOMBRE!B2,\" - \",\"( \",NOMBRE!C2,NOMBRE!D2,NOMBRE!E2,NOMBRE!F2,NOMBRE!G2,\" )\")","v":"COMUNA:  - (  )"}]
[{"$f":"CONCATENATE(\"ESTABLECIMIENTO/ESTRATEGIA: \",NOMBRE!B3,\" - \",\"( \",NOMBRE!C3,NOMBRE!D3,NOMBRE!E3,NOMBRE!F3,NOMBRE!G3,NOMBRE!H3,\" )\")","v":"ESTABLECIMIENTO/ESTRATEGIA:  - (  )"}]
[{"$f":"CONCATENATE(\"MES: \",NOMBRE!B6,\" - \",\"( \",NOMBRE!C6,NOMBRE!D6,\" )\")","v":"MES:  - (  )"}]
[{"$f":"CONCATENATE(\"AÑO: \",NOMBRE!B7)","v":"AÑO: 2017"}]
[null,null,null,"REM-B17.   ACTIVIDADES DE APOYO DIAGNOSTICO y TERAPEUTICO"]
["PARTE I"]
["SECCION A: ATENCIONES ABIERTAS "]
["CODIGOS","IDENTIFICACION DE PRESTACIONES","TOTAL PRODUCCIÓN","TOTAL BENEFICIARIOS MAI","PAGO POR PRESTACIONES ($)"]
[null,"CONSULTAS Y ATENCION MEDICA ",{"$f":"SUM(C11:C23)","v":78},{"$f":"SUM(D11:D23)","v":26},{"$f":"SUM(E11:E23)","v":231000}]
["0101101","Consulta o control médico integral en atención primaria",{"$f":"B!C5","v":6},{"$f":"B!E5","v":2},{"$f":"B!AL5","v":9180}]
["0101102","Consulta o control médico integral en especialidades (Hosp. Mediana Complejidad)",{"$f":"B!C6","v":6},{"$f":"B!E6","v":2},{"$f":"B!AL6","v":11560}]
["0101103","Consulta médica integral en servicio de urgencia (Hosp. Alta Complejidad)",{"$f":"B!C7","v":6},{"$f":"B!E7","v":2},{"$f":"B!AL7","v":24780}]
["0101104","Consulta médica integral en C.R.S.",{"$f":"B!C8","v":6},{"$f":"B!E8","v":2},{"$f":"B!AL8","v":14800}]
["0101105","Consulta médica integral en servicio de urgencia (Hosp. Mediana Complejidad)",{"$f":"B!C9","v":6},{"$f":"B!E9","v":2},{"$f":"B!AL9","v":16240}]
["0101106","Asistencia de cardiólogo a cirugías no cardíacas",{"$f":"B!C10","v":6},{"$f":"B!E10","v":2},{"$f":"B!AL10","v":31060}]
["0101107","Atención médica del recién nacido",{"$f":"B!C11","v":6},{"$f":"B!E11","v":2},{"$f":"B!AL11","v":31060}]
["0101108","Consulta integral de especialidades en Cirugía, Ginecología y Obstetricia, Ortopedia y Traumatología (en CDT)",{"$f":"B!C12","v":6},{"$f":"B!E12","v":2},{"$f":"B!AL12","v":12520}]
["0101109","Consulta integral de especialidades en Urología, Otorrinolaringología, Medicina Fisica y Rehabilitación, Dermatología, Pediatría y Subespecialidades (en CDT)",{"$f":"B!C13","v":6},{"$f":"B!E13","v":2},{"$f":"B!AL13","v":15020}]
["0101110","Consulta integral de especialidades en Medicina Interna y Subespecialidades, Oftalmología, Neurología, Oncología (en CDT)",{"$f":"B!C14","v":6},{"$f":"B!E14","v":2},{"$f":"B!AL14","v":18620}]
["0101111","Consulta integral de especialidades en Cirugía, Ginecología y Obstetricia, Ortopedia y Traumatología (Hosp. Alta Complejidad)",{"$f":"B!C15","v":6},{"$f":"B!E15","v":2},{"$f":"B!AL15","v":12520}]
["0101112","Consulta integral de especialidades en Urología, Otorrinolaringología, Medicina Física y Rehabilitación, Dermatología, Pediatría y Subespecialidades (Hosp. Alta Complejidad)",{"$f":"B!C16","v":6},{"$f":"B!E16","v":2},{"$f":"B!AL16","v":15020}]
["0101113","Consulta integral de especialidades en Medicina Interna y Subespecialidades, Oftalmología, Neurología, Oncología (Hosp. Alta Complejidad)",{"$f":"B!C17","v":6},{"$f":"B!E17","v":2},{"$f":"B!AL17","v":18620}]
["0903006","Consultoría de salud mental por psiquiatra (sesión 4 hrs.) (mínimo 8 pacientes)",{"$f":"B!C987","v":0},{"$f":"B!E987","v":0},{"$f":"B!AL987","v":0}]
[null,"OTRAS CONSULTAS Y ATENCION MEDICA",{"$f":"SUM(C26:C31)","v":0}]
["0101001","Consulta médica general",{"$f":"VLOOKUP(B26,tabla2,3,FALSE)","v":0}]
[null,"Consultas de urgencia en Hospitales de baja complejidad",{"$f":"VLOOKUP(B27,tabla2,3,FALSE)","v":0}]
[null,"Consultas de especialidad en hospitales de baja complejidad y establecimientos de APS",{"$f":"VLOOKUP(B28,tabla2,3,FALSE)","v":0}]
[null,"Otras consulta médica de especialidades ",{"$f":"VLOOKUP(B29,tabla2,3,FALSE)","v":0}]
[null,"Consulta médica de especialidad en servicio de urgencia",{"$f":"B!C23","v":0}]
[101308,"Consulta Médica de Especialidad en Obstetricia y Ginecología",{"$f":"B!C24","v":0}]
[null,"CONSULTAS POR OTROS PROFESIONALES DE LA SALUD",{"$f":"SUM(C33:C46)","v":0}]
["0102001","Consulta o control por enfermera, matrona o nutricionista",{"$f":"B!$C$28","v":0},{"$f":"B!$E$28","v":0},{"$f":"B!$AL$28","v":0}]
["0102002","Control de salud niño con EDP por enfermera",{"$f":"B!$C$29","v":0},{"$f":"B!$E$29","v":0},{"$f":"B!$AL$29","v":0}]
["0102003","Consulta o control por auxiliar de enfermería",{"$f":"B!$C$30","v":0},{"$f":"B!$E$30","v":0},{"$f":"B!$AL$30","v":0}]
["0102005","Consulta por fonoaudiólogo",{"$f":"B!$C$31","v":0},{"$f":"B!$E$31","v":0},{"$f":"B!$AL$31","v":0}]
["0102006","Atención kinesiológica integral ambulatoria",{"$f":"B!$C$32","v":0},{"$f":"B!$E$32","v":0},{"$f":"B!$AL$32","v":0}]
["0102007","Atención integral por terapeuta ocupacional",{"$f":"B!$C$33","v":0},{"$f":"B!$E$33","v":0},{"$f":"B!$AL$33","v":0}]
["0903002","Consulta o control psicológico clínico",{"$f":"B!$C$983","v":0},{"$f":"B!$E$983","v":0},{"$f":"B!$AL$983","v":0}]
["0903003","Consulta de salud mental por otros profesionales",{"$f":"B!$C$984","v":0},{"$f":"B!$E$984","v":0},{"$f":"B!$AL$984","v":0}]
["0903004","Intervención psicosocial grupal (4 a 8 pacientes, familiares o cuidadores)",{"$f":"B!$C$985","v":0},{"$f":"B!$E$985","v":0},{"$f":"B!$AL$985","v":0}]
["0903005","Psicoterapia de grupo (por psicólogo o psiquiatra) (4 a 8 pacientes)",{"$f":"B!$C$986","v":0},{"$f":"B!$E$986","v":0},{"$f":"B!$AL$986","v":0}]
["0903001","Consulta de psiquiatría",{"$f":"B!$C$982","v":0},{"$f":"B!$E$982","v":0},{"$f":"B!$AL$982","v":0}]
["0901009","Evaluación psiquiátrica previa a terapia (1ra. consulta).",{"$f":"B!C991","v":0}]
["0902001","Consulta Psicólogo clínico (sesiones 45')",{"$f":"B!C992","v":0}]
["0901005","Atención psiquiátrica o psicoterapia de familia, individual, de relajación o de manejo (con familia u otros);(cada sesión mínimo 45')",{"$f":"B!C993","v":0}]
[null,"OTRAS CONSULTAS Y ATENCION MEDICA",{"$f":"SUM(C48:C51)","v":0}]
[null,"Consulta por otros profesionales ",{"$f":"B!$C$35","v":0}]
[null,"Consultas/ Controles de Especialidades Odontológica",{"$f":"B!$C$36","v":0}]
[null,"Consultas de morbilidad odontológica",{"$f":"B!$C$37","v":0}]
[null,"Consultas de urgencia odontológica",{"$f":"B!$C$38","v":0}]
[null,"PROGRAMAS DE REHABILITACION",{"$f":"SUM(C53:C54)","v":0},{"$f":"SUM(D53:D54)","v":0},{"$f":"SUM(E53:E54)","v":0}]
["0903007","Programa de rehabilitación tipo 1 (mensual, grupo 6 a 10 pers.)",{"$f":"B!$C$988","v":0},{"$f":"B!$E$988","v":0},{"$f":"B!$AL$988","v":0}]
["0903008","Programa de rehabilitación tipo 2 (mensual, grupo 5 a 7 pers.)",{"$f":"B!$C$989","v":0},{"$f":"B!$E$989","v":0},{"$f":"B!$AL$989","v":0}]
[null,"OTROS PROGRAMAS",{"$f":"C56","v":0}]
["0901003","Electroshocks e insulino-terapia (efectuada y controlada por el médico psiquiatra, incluye trat. de las complicaciones medicas, c/s miorrelajantes); cada sesión (max.6)",{"$f":"B!$C$960","v":0}]
[null,"EDUCACION DE GRUPO",{"$f":"SUM(C58:C61)","v":0},{"$f":"SUM(D58:D61)","v":0},{"$f":"SUM(E58:E61)","v":0}]
["0103001","Educación de grupo por médico",{"$f":"B!$C$42","v":0},{"$f":"B!$E$42","v":0},{"$f":"B!$AL$42","v":0}]
["0103002","Educación de grupo por enfermera, matrona o nutricionista",{"$f":"B!$C$43","v":0},{"$f":"B!$E$43","v":0},{"$f":"B!$AL$43","v":0}]
["0103003","Educación de grupo por asistente social",{"$f":"B!$C$44","v":0},{"$f":"B!$E$44","v":0},{"$f":"B!$AL$44","v":0}]
["0103004","Educación de grupo por auxiliar de enfermería",{"$f":"B!$C$45","v":0},{"$f":"B!$E$45","v":0},{"$f":"B!$AL$45","v":0}]
[null,"OTRA EDUCADION DE GRUPO",{"$f":"C63","v":0}]
[null,"Educación de grupo por otro integrante del equipo de salud",{"$f":"B!$C$47","v":0}]
[null,"VISITAS DOMICILIARIAS",{"$f":"SUM(C65:C67)","v":0},{"$f":"SUM(D65:D67)","v":0},{"$f":"SUM(E65:E67)","v":0}]
["0104001","Visita a domicilio por enfermera, matrona o nutricionista",{"$f":"B!$C$51","v":0},{"$f":"B!$E$51","v":0},{"$f":"B!$AL$51","v":0}]
["0104002","Visita a domicilio por asistente social",{"$f":"B!$C$52","v":0},{"$f":"B!$E$52","v":0},{"$f":"B!$AL$52","v":0}]
["0104003","Visita a domicilio por auxiliar de enfermería",{"$f":"B!$C$53","v":0},{"$f":"B!$E$53","v":0},{"$f":"B!$AL$53","v":0}]
[null,"OTRAS VISITAS DOMICILIARIAS",{"$f":"SUM(C69:C70)","v":0}]
[null,"Visita a domicilio por otro integrante del equipo de salud",{"$f":" B!$C$55","v":0}]
[null,"Visita domiciaria por profesional y técnico paramédico",{"$f":"B!$C$56","v":0}]
[null,"TOTAL ",{"$f":"C10+C32+C52+C57+C64+C24+C25+C47+C55+C62+C68","v":78},{"$f":"D10+D32+D52+D57+D64+D24","v":26},{"$f":"E10+E32+E52+E57+E64+E24","v":231000}]
["SECCION B: EXÁMENES DE DIAGNÓSTICO"]
["TIPO DE EXAMEN",null,"TOTAL PRODUCCIÓN","TOTAL BENEFICIARIOS MAI","PAGO POR PRESTACIONES ($)"]
["TOTAL EXAMENES LABORATORIO",null,{"$f":"SUM(C75:C80,C84:C87)","v":168},{"$f":"SUM(D75:D79,D80,D84:D86)","v":56},{"$f":"SUM(E75:E79,E80,E84:E86)","v":144580}]
["I  ","HEMATOLOGICOS",{"$f":"B!$C$209","v":168},{"$f":"B!$E$209","v":56},{"$f":"B!$AL$209","v":144580}]
["II  ","BIOQUIMICOS",{"$f":"B!$C$271","v":0},{"$f":"SUM(B!E211:E214,B!E215:E259,B!E260:E270)","v":0},{"$f":"B!$AL$271","v":0}]
["III","HORMONALES",{"$f":"B!$C$310","v":0},{"$f":"B!$E$310","v":0},{"$f":"B!$AL$310","v":0}]
["IV","GENETICA",{"$f":"B!$C$317","v":0},{"$f":"B!$E$317","v":0},{"$f":"B!$AL$317","v":0}]
["V","INMUNOLOGICOS",{"$f":"B!$C$373","v":0},{"$f":"B!$E$373","v":0},{"$f":"B!$AL$373","v":0}]
["VI  ","MICROBIOLOGICOS",{"$f":"SUM(C81:C83)","v":0},{"$f":"SUM(D81:D83)","v":0},{"$f":"SUM(E81:E83)","v":0}]
[null,"a)   BACTERIAS Y HONGOS",{"$f":"B!$C$410","v":0},{"$f":"B!$E$410","v":0},{"$f":"B!$AL$410","v":0}]
[null,"b)   PARASITOS",{"$f":"B!$C$431","v":0},{"$f":"SUM(B!E412:E428,B!E429:E430)","v":0},{"$f":"B!$AL$431","v":0}]
[null,"c)   VIRUS",{"$f":"B!$C$450","v":0},{"$f":"B!$E$450","v":0},{"$f":"B!$AL$450","v":0}]
["VII","PROCEDIMIENTO O DETERMINACION DIRECTA C/PACIENTE",{"$f":"B!$C$460","v":0},{"$f":"B!$E$460","v":0},{"$f":"B!$AL$460","v":0}]
["VIII  ","EX.  DE DEPOSICIONES EXUDADOS. SECREC. Y OTROS LIQ.  ",{"$f":"B!$C$511","v":0},{"$f":"SUM(B!E474:E497,B!E498:E510)","v":0},{"$f":"B!$AL$511","v":0}]
["IX   ","ORINA",{"$f":"B!$C$541","v":0},{"$f":"B!$E$541","v":0},{"$f":"B!$AL$541","v":0}]
["X","OTROS EXAMENES DE LABORATORIO",{"$f":"B!$C$2943","v":0},{"$f":"B!$E$2943","v":0}]
["TOTAL EXAMENES IMAGENOLOGIA",null,{"$f":"+C89+C90+C91+C92+C96+C97","v":0},{"$f":"+D89+D90+D91+D92+D96","v":0},{"$f":"+E89+E90+E91+E92+E96","v":0}]
["I. a)","EX. RADIOLOGICOS SIMPLES",{"$f":"B!$C$599","v":0},{"$f":"SUM(B!E544:E545,B!E546,B!E547,B!E548:E558,B!E559:E565,B!E566:E574,B!E575,B!E576:E594,B!E595:E597)","v":0},{"$f":"B!$AL$599","v":0}]
["I. b)","EX. RADIOLOGICOS COMPLEJOS",{"$f":"B!$C$622","v":0},{"$f":"B!$E$622","v":0},{"$f":"B!$AL$622","v":0}]
["II.","TOMOGRAFIA AXIAL COMP.",{"$f":"B!$C$649","v":0},{"$f":"B!$E$649","v":0},{"$f":"B!$AL$649","v":0}]
["III","ULTRASONOGRAFIA",{"$f":"SUM(C93:C95)","v":0},{"$f":"SUM(D93:D95)","v":0},{"$f":"SUM(E93:E95)","v":0}]
[null,"Ecotomografias ( Sin Ecografía Obstetr. Y Abdominal )",{"$f":"B!$C$671-B!C651-B!C652","v":0},{"$f":"B!$E$671-B!E651-B!E652","v":0},{"$f":"B!$AL$671-B!$AL$651-B!$AL$652","v":0}]
[null,"Ecografías Obstétricas",{"$f":"B!$C$651","v":0},{"$f":"B!$E$651","v":0},{"$f":"B!$AL$651","v":0}]
[null,"Ecotomografias abdominal ",{"$f":"B!$C$652","v":0},{"$f":"B!$E$652","v":0},{"$f":"B!$AL$652","v":0}]
["IV","RESONANCIA MAGNÉTICA ",{"$f":"B!$C$703","v":0},{"$f":"B!$E$703","v":0},{"$f":"B!$AL$703","v":0}]
[null,"OTROS EXÁMENES DE IMÁGENES",{"$f":"B!$C$762","v":0},{"$f":"B!$E$762","v":0}]
[null,"TOTAL EXAMENES ANATOMIA PATOLOGICA",{"$f":"B!$C$957","v":0},{"$f":"B!$E$957","v":0},{"$f":"B!$AL$957","v":0}]
["SECCION C: PROCEDIMIENTOS DE MEDICINA NUCLEAR , GINECOLOGÍA Y OBSTETRICIA, Y ORTOPEDIA"]
["CÓDIGOS","IDENTIFICACION DE PRESTACIONES","TOTAL PRODUCCIÓN","TOTAL BENEFICIARIOS MAI","PAGO POR PRESTACIONES ($)"]
["05","PROCEDIMIENTOS DE MEDICINA NUCLEAR",{"$f":"B!C769+B!C776+B!C780+B!C787+B!C796+B!C800+B!C804+B!C808+B!C819+B!C827+B!C832+B!C850+B!C868+B!C816","v":0},{"$f":"B!E769+B!E776+B!E780+B!E787+B!E796+B!E800+B!E804+B!E808+B!E819+B!E827+B!E832+B!E850+B!E868+B!E816","v":0},{"$f":"B!AL769+B!AL776+B!AL780+B!AL787+B!AL796+B!AL800+B!AL804+B!AL808+B!AL819+B!AL827+B!AL832+B!AL850+B!AL868+B!AL816","v":0}]
[2001,"PROCEDIMIENTOS DE GINECOLOGIA Y OBSTETRICIA",{"$f":"B!C2227+B!C2270+B!C2271","v":0},{"$f":"B!E2218+B!E2270+B!E2271","v":0},{"$f":"B!AL2218+B!AL2270+B!AL2271","v":0}]
["2107","PROCEDIMIENTOS DE ORTOPEDIA",{"$f":"B!C2533","v":0},{"$f":"B!E2533","v":0},{"$f":"B!AL2533","v":0}]
[null,"SUB-TOTAL FACTURACION SECCION C",{"$f":"SUM(C101:C103)","v":0},{"$f":"SUM(D101:D103)","v":0},{"$f":"SUM(E101:E103)","v":0}]
["SECCION D: INTERVENCIONES QUIRÚRGICAS "]
["CODIGOS","IDENTIFICACION DE PRESTACIONES","TOTAL PRODUCCIÓN","TOTAL BENEFICIARIOS MAI",1,0.5,0.75,"PAGO POR PRESTACIONES ($)"]
["1103","I NEUROCIRUGIA",{"$f":"B!$C$1129","v":0},{"$f":"B!$I$1129","v":0},null,null,null,{"$f":"B!$AL$1129","v":0}]
["1202","II CIRUGIA OFTALMOLOGICA",{"$f":"B!C1266","v":0},{"$f":"B!I1266","v":0},null,null,null,{"$f":"B!$AL$1266","v":0}]
["1302","III CIRUGIA OTORRINOLOGICA",{"$f":"B!C1408","v":0},{"$f":"B!I1405","v":0},{"$f":"B!I1405","v":0},{"$f":"B!L1405","v":0},null,{"$f":"B!$AL$1405","v":0}]
["1402","IV CIRUGIA DE CABEZA Y CUELLO",{"$f":"B!C1472","v":0},{"$f":"B!I1472","v":0},null,null,null,{"$f":"B!AL1472","v":0}]
["1502","V CIRUGIA PLASTICA Y REPARADORA",{"$f":"B!$C$1541","v":0},{"$f":"B!$I$1541","v":0},null,null,null,{"$f":"B!$AL$1541","v":0}]
["1602","VI DERMATOLOGIA Y TEGUMENTOS",{"$f":"B!$C$1586","v":0},{"$f":"B!$I$1586","v":0},null,null,null,{"$f":"B!$AL$1586","v":0}]
["1703","VII CIRUGIA CARDIOVASCULAR",{"$f":"B!$C$1804","v":0},{"$f":"B!$I$1791","v":0},null,null,null,{"$f":"B!$AL$1791","v":0}]
["1704","VIII CIRUGIA TORAXICA",{"$f":"B!$C$1874","v":0},{"$f":"B!$I$1870","v":0},null,null,null,{"$f":"B!$AL$1870","v":0}]
["1802","IX CIRUGIA ABDOMINAL",{"$f":"B!$C$2036","v":0},{"$f":"B!$I$2029","v":0},null,null,null,{"$f":"B!$AL$2029","v":0}]
["1803","X CIRUGIA PROCTOLOGICA",{"$f":"B!C2075","v":0},{"$f":"B!I2075","v":0},null,null,null,{"$f":"B!AL2075","v":0}]
["1902","XI CIRUGIA UROLOGICA Y SUPRARRENAL",{"$f":"B!$C$2198","v":0},{"$f":"B!I2198","v":0},null,null,null,{"$f":"B!AL2198","v":0}]
["2002","XII CIRUGIA DE LA MAMA",{"$f":"B!$C$2233","v":0},{"$f":"B!I2233","v":0},null,null,null,{"$f":"B!$AL$2233","v":0}]
["2003","XIII CIRUGIA GINECOLOGICA",{"$f":"B!$C$2268","v":0},{"$f":"B!$I$2268","v":0},null,null,null,{"$f":"B!$AL$2268","v":0}]
["2004","XIV CIRUGIA OBSTETRICA ",{"$f":"SUM(C121:C123)","v":14},{"$f":"SUM(D121:D123)","v":0},null,null,null,{"$f":"SUM(H121:H123)","v":1133480}]
[null,"Cesárea c/s salpingoligadura o salpingectomía",{"$f":"B!C2274","v":6},{"$f":"B!E2274","v":0},null,null,null,{"$f":"B!AL2274","v":284020}]
[null,"Cesárea con histerectomía",{"$f":"B!C2275","v":4},{"$f":"B!E2275","v":0},null,null,null,{"$f":"B!AL2275","v":558080}]
[null,"Cesárea ",{"$f":"B!C2276","v":4},{"$f":"B!E2276","v":0},null,null,null,{"$f":"B!AL2276","v":291380}]
["2104 ","XV  TRAUMATOLOGIA ",{"$f":"B!$C$2509","v":0},{"$f":"B!$I$2509","v":0},null,null,null,{"$f":"B!$AL$2509","v":0}]
[2106,"XVI  RETIRO ELEMENTOS OSTEOSINTESIS",{"$f":"B!$C2521","v":0},{"$f":"B!$I2521","v":0},null,null,{"$f":"B!C2521","v":0},{"$f":"B!$AL2521","v":0}]
[null,"SUB-TOTAL FACTURACION SECCION D",{"$f":"SUM(C107:C119)+C124+C125","v":0},{"$f":"SUM(D107:D119)+D124+D125","v":0},null,null,null,{"$f":"SUM(H107:H119)+H124+H125","v":0}]
["SECCION E: ATENCION CERRADA, DIAS DE HOSPITALIZACION "]
["CODIGOS","IDENTIFICACION DE PRESTACIONES","TOTAL PRODUCCIÓN","TOTAL BENEFICIARIOS MAI","PAGO POR PRESTACIONES ($)"]
[null,"ATENCION CERRADA "]
["0203001","Día cama hospitalización integral medicina, cirugía, pediatría, obstetricia-ginecología y especialidades (sala 3 camas o más) (Hosp. Alta Complejidad)",{"$f":"B!$C$114","v":0},{"$f":"B!$E$114","v":0},{"$f":"B!$AL$114","v":0}]
["0203102","Día cama hospitalización integral medicina, cirugía, pediatría, obstetricia-ginecología y especialidades (sala 3 camas o más) (Hosp. Mediana Complejidad)",{"$f":"B!$C$115","v":0},{"$f":"B!$E$115","v":0},{"$f":"B!$AL$115","v":0}]
["0203103","Día cama hospitalización integral medicina, cirugía, pediatría, obstetricia-ginecología y especialidades (sala 3 camas o más) (Hosp. Baja Complejidad)",{"$f":"B!$C$116","v":0},{"$f":"B!$E$116","v":0},{"$f":"B!$AL$116","v":0}]
["0203002","Día cama hospitalización integral adulto en Unidad de Cuidado Intensivo (U.C.I.) ",{"$f":"B!$C$117","v":0},{"$f":"B!$E$117","v":0},{"$f":"B!$AL$117","v":0}]
["0203003","Día cama hospitalización integral pediátrica en Unidad de Cuidado Intensivo (U.C.I). ",{"$f":"B!$C$118","v":0},{"$f":"B!$E$118","v":0},{"$f":"B!$AL$118","v":0}]
["0203004","Día cama hospitalización integral neonatal en Unidad de Cuidado Intensivo (U.C.I.)",{"$f":"B!$C$119","v":0},{"$f":"B!$E$119","v":0},{"$f":"B!$AL$119","v":0}]
["0203005","Día cama hospitalización integral adulto en Unidad de Tratamiento Intermedio (U.T.I)",{"$f":"B!$C$120","v":0},{"$f":"B!$E$120","v":0},{"$f":"B!$AL$120","v":0}]
["0203006","Día cama hospitalización integral pediátrica en Unidad de Tratamiento Intermedio (U.T.I)",{"$f":"B!$C$121","v":0},{"$f":"B!$E$121","v":0},{"$f":"B!$AL$121","v":0}]
["0203007","Día cama hospitalización integral neonatal en Unidad de Tratamiento Intermedio (U.T.I)",{"$f":"B!$C$122","v":0},{"$f":"B!$E$122","v":0},{"$f":"B!$AL$122","v":0}]
["0203008","Día cama hospitalización integral incubadora",{"$f":"B!$C$123","v":0},{"$f":"B!$E$123","v":0},{"$f":"B!$AL$123","v":0}]
["0203009","Día cama hospitalización integral psiquiatría crónicos",{"$f":"B!$C$124","v":0},{"$f":"B!$E$124","v":0},{"$f":"B!$AL$124","v":0}]
["0203109","Día cama hosp. integral psiquiatría corta estadía",{"$f":"B!$C$125","v":0},{"$f":"B!$E$125","v":0},{"$f":"B!$AL$125","v":0}]
["0203209","Día cama hosp. integral desintoxicación alcohol y drogas",{"$f":"B!$C$126","v":0},{"$f":"B!$E$126","v":0},{"$f":"B!$AL$126","v":0}]
[null,"SUB TOTAL ATENCION CERRADA",{"$f":"SUM(C130:C142)","v":0},{"$f":"SUM(D130:D142)","v":0},{"$f":"SUM(E130:E142)","v":0}]
[null,"MISCELANEOS DIAS CAMA",{"$f":"SUM(C145:C154)","v":0},{"$f":"SUM(D145:D154)","v":0},{"$f":"SUM(E145:E154)","v":0}]
["0203010","Día cama integral psiquiátrico diurno",{"$f":"B!$C$129","v":0},{"$f":"B!$E$129","v":0},{"$f":"B!$AL$129","v":0}]
["0203110","Día cama hospitalización integral psiquiatría mediana estadía",{"$f":"B!$C$130","v":0},{"$f":"B!$E$130","v":0},{"$f":"B!$AL$130","v":0}]
["0203011","Día cama integral de observación o día cama integral ambulatorio diurno",{"$f":"B!$C$131","v":0},{"$f":"B!$E$131","v":0},{"$f":"B!$AL$131","v":0}]
["0203111","Camilla de observación en servicio de urgencia",{"$f":"B!$C$132","v":0},{"$f":"B!$E$132","v":0},{"$f":"B!$AL$132","v":0}]
["0203012","Día cama integral geriatría o crónicos",{"$f":"B!$C$133","v":0},{"$f":"B!$E$133","v":0},{"$f":"B!$AL$133","v":0}]
["0203013","Día estada en cámara hiperbárica",{"$f":"B!$C$134","v":0},{"$f":"B!$E$134","v":0},{"$f":"B!$AL$134","v":0}]
["0203014","Día cama hogar embarazada rural (del Servicio de Salud)",{"$f":"B!$C$135","v":0},{"$f":"B!$E$135","v":0},{"$f":"B!$AL$135","v":0}]
["0203015","Día cuna de hospitalización integral",{"$f":"B!$C$136","v":0},{"$f":"B!$E$136","v":0},{"$f":"B!$AL$136","v":0}]
["0203016","Día cama hospitalización integral urgencia H.U.A.P. (Sólo Hospital Urgencia Asistencia Pública)",{"$f":"B!$C$137","v":0},{"$f":"B!$E$137","v":0},{"$f":"B!$AL$137","v":0}]
["0203017","Día cama hogar protegido paciente psiquiátrico compensado",{"$f":"B!$C$138","v":0},{"$f":"B!$E$138","v":0},{"$f":"B!$AL$138","v":0}]
[null,"OTRO DIA CAMA",{"$f":"SUM(C156:C160)","v":0}]
[203211,"Día Cama Residencia Protegida",{"$f":"B!$C$140","v":0}]
["\"0202101","Día Cama de Hospitalización Medicina y Especialidades (sala 3 camas o más de pensionado o medio pensionado).",{"$f":"B!C141","v":0}]
["0202105","Día Cama de Hospitalización Cirugía (sala 3 camas o más de pensionado o medio pensionado)",{"$f":"B!C142","v":0}]
["0202109","Día Cama de Hospitalización Pediatría (sala 3 camas o más de pensionado o medio pensionado)",{"$f":"B!C143","v":0}]
["0202113","Día Cama de Hospitalización Obstetricia y Ginecología (sala 3 camas o más de pensionado o medio pensionado)",{"$f":"B!C144","v":0}]
[null,"TOTAL DIAS CAMA DE HOSPITALIZACION",{"$f":"(C143+C144+C155)","v":0},{"$f":"(D143+D144)","v":0},{"$f":"(E143+E144)","v":0}]
["SECCION F: ACTIVIDADES PROTECCION ESPECIFICA "]
["CODIGOS","IDENTIFICACION DE PRESTACIONES","TOTAL PRODUCCIÓN","TOTAL BENEFICIARIOS MAI","PAGO POR PRESTACIONES ($)"]
["0105001","Vacunaciones (sólo considera administración)",{"$f":"B!$C$60","v":0},{"$f":"B!$E$60","v":0},{"$f":"B!$AL$60","v":0}]
["0105002 y 003","Desparasitación sarna y pediculosis (cada persona)",{"$f":"SUM(B!$C$61+B!$C$62)","v":0},{"$f":"SUM(B!$E$61+B!$E$62)","v":0},{"$f":"SUM(B!$AL$61+B!$AL$62)","v":0}]
[null,"SUB-TOTAL FACTURACION SECCION F",{"$f":"SUM(C164:C165)","v":0},{"$f":"SUM(D164:D165)","v":0},{"$f":"SUM(E164:E165)","v":0}]
["SECCION G: PROCEDIMIENTOS DIAGNOSTICOS Y TERAPEUTICOS"]
["CODIGOS","IDENTIFICACION DE PRESTACIONES","TOTAL PRODUCCIÓN","TOTAL BENEFICIARIOS MAI","PAGO POR PRESTACIONES ($)"]
[1101004,"E.E.G. de 16 o más canales (incluye el cód. 11-01-006)",{"$f":"B!$C$997","v":0},{"$f":"B!$E$997","v":0},{"$f":"B!$AL$997","v":0}]
[1101006,"Electroencefalograma (E.E.G.) standard y/o activado...., de 8 canales",{"$f":"B!$C$998","v":0},{"$f":"B!$E$998","v":0},{"$f":"B!$AL$998","v":0}]
["1701001","E.C.G. de reposo (incluye mínimo 12 derivaciones y 4 complejos por derivación)",{"$f":"B!$C$1697","v":0},{"$f":"B!$E$1697","v":0},{"$f":"B!$AL$1697","v":0}]
["1701003","Ergometría (incluye E.C.G. antes, durante y después del ejercicio con monitoreo continuo y medición de la intensidad del esfuerzo)",{"$f":"B!$C$1698","v":0},{"$f":"B!$E$1698","v":0},{"$f":"B!$AL$1698","v":0}]
["1701006","E.C.G. continuo (test Holter o similares, por ej. variabilidad de la frecuencia cardíaca y/o alta resolución del ST y/o depolarización tardía); 20 a 24 horas de registro",{"$f":"B!$C$1699","v":0},{"$f":"B!$E$1699","v":0},{"$f":"B!$AL$1699","v":0}]
["1701007","Ecocardiograma Doppler, con registro (incluye cód.17.01.008)",{"$f":"B!$C$1700","v":0},{"$f":"B!$E$1700","v":0},{"$f":"B!$AL$1700","v":0}]
["1701045","Ecocardiograma Doppler color",{"$f":"B!$C$1701","v":0},{"$f":"B!$E$1701","v":0},{"$f":"B!$AL$1701","v":0}]
["1701008","Ecocardiograma bidimensional (incluye registro modo M, papel fotosensible y fotografía), en adultos o niños (proc. aut.)",{"$f":"B!$C$1702","v":0},{"$f":"B!$E$1702","v":0},{"$f":"B!$AL$1702","v":0}]
["1701010","Sondeo cardíaco derecho c/s termodilución, en adultos o niños",{"$f":"B!$C$1703","v":0},{"$f":"B!$E$1703","v":0},{"$f":"B!$AL$1703","v":0}]
["1701011","Sondeo cardíaco izquierdo y derecho, en adultos o niños",{"$f":"B!$C$1704","v":0},{"$f":"B!$E$1704","v":0},{"$f":"B!$AL$1704","v":0}]
["1701012","Sondeo cardíaco izquierdo, en adultos o niños",{"$f":"B!$C$1705","v":0},{"$f":"B!$E$1705","v":0},{"$f":"B!$AL$1705","v":0}]
["1701019","Cinecoronariografía derecha y/o izquierda (incluye sondeo cardíaco izq.  y ventriculografía izq.) ",{"$f":"B!$C$1706","v":0},{"$f":"B!$E$1706","v":0},{"$f":"B!$AL$1706","v":0}]
["1701020","Ventriculografía derecha, en adultos o niños (incl. proc. rad. y sondeo cardíaco derecho)",{"$f":"B!$C$1707","v":0},{"$f":"B!$E$1707","v":0},{"$f":"B!$AL$1707","v":0}]
["1701021","Ventriculografía izquierda, en adultos o niños (incl. proc. rad. y sondeo cardíaco izquierdo)",{"$f":"B!$C$1708","v":0},{"$f":"B!$E$1708","v":0},{"$f":"B!$AL$1708","v":0}]
["1701022","Aortografía, en adultos o niños (Incluye proc. rad.)",{"$f":"B!$C$1709","v":0},{"$f":"B!$E$1709","v":0},{"$f":"B!$AL$1709","v":0}]
["1701023","Arteriografía de extremidades, en adultos o niños (incluye proc. rad.)",{"$f":"B!$C$1710","v":0},{"$f":"B!$E$1710","v":0},{"$f":"B!$AL$1710","v":0}]
["1701024","Arteriografía selectiva o superselectiva (pulmonar, renal, tronco celíaco, etc)  en adultos o niños (incl. proc. rad.)  ",{"$f":"B!$C$1711","v":0},{"$f":"B!$E$1711","v":0},{"$f":"B!$AL$1711","v":0}]
["1701131","Angioplastía Intraluminal coronaria uno o mult. vasos(incl. proc. rad; balón, rotablator, Stent o similar)",{"$f":"B!$C$1712","v":0},{"$f":"B!$E$1712","v":0},{"$f":"B!$AL$1712","v":0}]
["1701132","Angioplastía Intraluminal periférica (incluye proc. rad., balón, Stent o similar)",{"$f":"B!$C$1713","v":0},{"$f":"B!$E$1713","v":0},{"$f":"B!$AL$1713","v":0}]
["1701043","Angioplastía de coartación aórtica (incl. proc. rad.) (proc. completo)",{"$f":"B!$C$1714","v":0},{"$f":"B!$E$1714","v":0},{"$f":"B!$AL$1714","v":0}]
["1701144","Angioplastía de arteria pulmonar o vena cava en niños (incluye proc. rad., balón, Stent o similar)",{"$f":"B!$C$1715","v":0},{"$f":"B!$E$1715","v":0},{"$f":"B!$AL$1715","v":0}]
["1701033","Biopsia endomiocárdica (proc. completo)",{"$f":"B!$C$1716","v":0},{"$f":"B!$E$1716","v":0},{"$f":"B!$AL$1716","v":0}]
["1701038","Septostomía de Rashkind",{"$f":"B!$C$1717","v":0},{"$f":"B!$E$1717","v":0},{"$f":"B!$AL$1717","v":0}]
["1701035","Colocación de sonda marcapaso transitorio (proc. completo)",{"$f":"B!$C$1718","v":0},{"$f":"B!$E$1718","v":0},{"$f":"B!$AL$1718","v":0}]
["1701141","Valvuloplastía mitral o tricúspide (incl. proc. radiológico,  incluye balón)",{"$f":"B!$C$1719","v":0},{"$f":"B!$E$1719","v":0},{"$f":"B!$AL$1719","v":0}]
["1701142","Valvuloplastía aórtica y pulmonar (incl. proc. radiológico,  incluye balón)",{"$f":"B!$C$1720","v":0},{"$f":"B!$E$1720","v":0},{"$f":"B!$AL$1720","v":0}]
[1801001,"Gastroduodenoscopía (incluye esofagoscopía)",{"$f":"B!$C$1941","v":0},{"$f":"B!$E$1941","v":0},{"$f":"B!$AL$1941","v":0}]
[1801003,"Yeyuno-ileoscopía (incluye esofago-gastro-duodenoscopía)",{"$f":"B!$C$1942","v":0},{"$f":"B!$E$1942","v":0},{"$f":"B!$AL$1942","v":0}]
[1801006,"Colonoscopía larga (incluye sigmoidoscopía y ....)",{"$f":"B!$C$1943","v":0},{"$f":"B!$E$1943","v":0},{"$f":"B!$AL$1943","v":0}]
[1401001,"Punción evacuadora de quiste tiroídeo c/s toma de muestra, c/s inyección de medicamentos",{"$f":"B!$C$1410","v":0},{"$f":"B!$E$1410","v":0},{"$f":"B!$AL$1410","v":0}]
[1101113,"Angiografía cerebral digital por cateterización femoral (incluye proc. Radiológico, medio de contraste e insumos)",{"$f":"B!$C$999","v":0},{"$f":"B!$E$999","v":0},{"$f":"B!$AL$999","v":0}]
[1101140,"Esclerosis Múltiple Remitente Recurrente,  Tratamiento médico farmacológico  Anual (incluye inmunomoduladores)",{"$f":"B!$C$1000","v":0},{"$f":"B!$E$1000","v":0},{"$f":"B!$AL$1000","v":0}]
[1101141,"Esclerosis Múltiple Remitente Recurrente, Tratamiento rehabilitación",{"$f":"B!$C$1001","v":0},{"$f":"B!$E$1001","v":0},{"$f":"B!$AL$1001","v":0}]
[1101142,"Esclerosis Múltiple Remitente Recurrente,  Tratamiento Brote",{"$f":"B!$C$1002","v":0},{"$f":"B!$E$1002","v":0},{"$f":"B!$AL$1002","v":0}]
[null,"SUB-TOTAL FACTURACION SECCION G",{"$f":"SUM(C169:C202)","v":0},{"$f":"SUM(D169:D202)","v":0},{"$f":"SUM(E169:E202)","v":0}]
["SECCIÓN H:PROGRAMA NACIONAL DE DROGAS ANTINEOPLASICAS P.N.D.A. (SOLO SERVICIOS DE SALUD ACREDITADOS)"]
["CODIGOS",null,"TOTAL PRODUCCIÓN","TOTAL BENEFICIARIOS MAI","PAGO POR PRESTACIONES ($)"]
[null,"TUMORES DEL ADULTO",{"$f":"SUM(C207:C220)","v":0},{"$f":"SUM(D207:D220)","v":0},{"$f":"SUM(E207:E220)","v":0}]
["3002001","Linfoma de Hodgkin",{"$f":"B!$C$2749","v":0},{"$f":"B!$E$2749","v":0},{"$f":"B!$AL$2749","v":0}]
["3002002","Linfoma No Hodgkin no agresivo",{"$f":"B!$C$2750","v":0},{"$f":"B!$E$2750","v":0},{"$f":"B!$AL$2750","v":0}]
["3002003","Linfoma No Hodgkin intermedio",{"$f":"B!$C$2751","v":0},{"$f":"B!$E$2751","v":0},{"$f":"B!$AL$2751","v":0}]
["3002004","Linfoma No Hodgkin., agresivo",{"$f":"B!$C$2752","v":0},{"$f":"B!$E$2752","v":0},{"$f":"B!$AL$2752","v":0}]
["3002005","Leucemia linfoblastica",{"$f":"B!$C$2753","v":0},{"$f":"B!$E$2753","v":0},{"$f":"B!$AL$2753","v":0}]
["3002006","Leucemia Aguda No linfática aguda y Leucemia Promielocítica",{"$f":"B!$C$2754","v":0},{"$f":"B!$E$2754","v":0},{"$f":"B!$AL$2754","v":0}]
["3002007","Cáncer de Testículo y  Germinales extragonadales",{"$f":"B!$C$2755","v":0},{"$f":"B!$E$2755","v":0},{"$f":"B!$AL$2755","v":0}]
["3002008","Enfermedad Trofoblástica Gestacional",{"$f":"B!$C$2756","v":0},{"$f":"B!$E$2756","v":0},{"$f":"B!$AL$2756","v":0}]
["3002033","Rescate de Linfomas",{"$f":"B!$C$2757","v":0},{"$f":"B!$E$2757","v":0},{"$f":"B!$AL$2757","v":0}]
["3002034","Ca. Mama etapa I y II",{"$f":"B!$C$2758","v":0},{"$f":"B!$E$2758","v":0},{"$f":"B!$AL$2758","v":0}]
["3002135","Ca mama etapa III",{"$f":"B!$C$2759","v":0},{"$f":"B!$E$2759","v":0},{"$f":"B!$AL$2759","v":0}]
["3002136","Ca mama etapa IV",{"$f":"B!$C$2760","v":0},{"$f":"B!$E$2760","v":0},{"$f":"B!$AL$2760","v":0}]
["3002137","Ca mama etapa IV metástasis ósea",{"$f":"B!$C$2761","v":0},{"$f":"B!$E$2761","v":0},{"$f":"B!$AL$2761","v":0}]
["3002036","Ca. Cérvico Uterino",{"$f":"B!$C$2762","v":0},{"$f":"B!$E$2762","v":0},{"$f":"B!$AL$2762","v":0}]
["TUMORES INFANTILES",null,{"$f":"SUM(C222:C239)","v":0},{"$f":"SUM(D222:D239)","v":0},{"$f":"SUM(E222:E239)","v":0}]
["3002009","Linfoma de Hodgkin",{"$f":"B!$C$2763","v":0},{"$f":"B!$E$2763","v":0},{"$f":"B!$AL$2763","v":0}]
["3002010","Linfoma B y LLA-B",{"$f":"B!$C$2764","v":0},{"$f":"B!$E$2764","v":0},{"$f":"B!$AL$2764","v":0}]
["3002011","Linfoma Linfoblástico",{"$f":"B!$C$2765","v":0},{"$f":"B!$E$2765","v":0},{"$f":"B!$AL$2765","v":0}]
["3002012","Leucemia linfoblástica aguda",{"$f":"B!$C$2766","v":0},{"$f":"B!$E$2766","v":0},{"$f":"B!$AL$2766","v":0}]
["3002013","Leucemia Mieloide Aguda",{"$f":"B!$C$2767","v":0},{"$f":"B!$E$2767","v":0},{"$f":"B!$AL$2767","v":0}]
["3002014","Neuroblastoma",{"$f":"B!$C$2768","v":0},{"$f":"B!$E$2768","v":0},{"$f":"B!$AL$2768","v":0}]
["3002015","Osteosarcoma",{"$f":"B!$C$2769","v":0},{"$f":"B!$E$2769","v":0},{"$f":"B!$AL$2769","v":0}]
["3002016","Sarcoma partes blandas",{"$f":"B!$C$2770","v":0},{"$f":"B!$E$2770","v":0},{"$f":"B!$AL$2770","v":0}]
["3002017","Ewing",{"$f":"B!$C$2771","v":0},{"$f":"B!$E$2771","v":0},{"$f":"B!$AL$2771","v":0}]
["3002107","Tumores germinales Extra Sistema Nerviso Central (Extra SNC)",{"$f":"B!$C$2772","v":0},{"$f":"B!$E$2772","v":0},{"$f":"B!$AL$2772","v":0}]
["3002020","Tumor de Wilms",{"$f":"B!$C$2773","v":0},{"$f":"B!$E$2773","v":0},{"$f":"B!$AL$2773","v":0}]
["3002021","Retinoblastoma",{"$f":"B!$C$2774","v":0},{"$f":"B!$E$2774","v":0},{"$f":"B!$AL$2774","v":0}]
["3002022","Histiocitosis",{"$f":"B!$C$2775","v":0},{"$f":"B!$E$2775","v":0},{"$f":"B!$AL$2775","v":0}]
["3002024","Recaída tumores sólidos",{"$f":"B!$C$2776","v":0},{"$f":"B!$E$2776","v":0},{"$f":"B!$AL$2776","v":0}]
["3002025","Hepatoblastomas",{"$f":"B!$C$2777","v":0},{"$f":"B!$E$2777","v":0},{"$f":"B!$AL$2777","v":0}]
["3002026","Leucemias mieloide crónica",{"$f":"B!$C$2778","v":0},{"$f":"B!$E$2778","v":0},{"$f":"B!$AL$2778","v":0}]
["3002126","Recaída de Leucemia Mieloide",{"$f":"B!$C$2779","v":0},{"$f":"B!$E$2779","v":0},{"$f":"B!$AL$2779","v":0}]
["3002027","Recaídas de leucemias Linfoblasticas",{"$f":"B!$C$2780","v":0},{"$f":"B!$E$2780","v":0},{"$f":"B!$AL$2780","v":0}]
[null,"TUMORES CEREBRALES INFANTILES",{"$f":"SUM(C241:C246)","v":0},{"$f":"SUM(D241:D246)","v":0},{"$f":"SUM(E241:E246)","v":0}]
["3002028","Méduloblastomas",{"$f":"B!$C$2781","v":0},{"$f":"B!$E$2781","v":0},{"$f":"B!$AL$2781","v":0}]
["3002029","Tumores de < de 3 años",{"$f":"B!$C$2782","v":0},{"$f":"B!$E$2782","v":0},{"$f":"B!$AL$2782","v":0}]
["3002030","Glioma",{"$f":"B!$C$2783","v":0},{"$f":"B!$E$2783","v":0},{"$f":"B!$AL$2783","v":0}]
["3002031","Astrocitomas",{"$f":"B!$C$2784","v":0},{"$f":"B!$E$2784","v":0},{"$f":"B!$AL$2784","v":0}]
["3002032","Tumor Germinal SNC",{"$f":"B!$C$2785","v":0},{"$f":"B!$E$2785","v":0},{"$f":"B!$AL$2785","v":0}]
["3002023","Cuidados Paliativos y Alivio del Dolor en Cáncer Terminal (en adultos o niños)",{"$f":"B!$C$2786","v":0},{"$f":"B!$E$2786","v":0},{"$f":"B!$AL$2786","v":0}]
[null,"PROGRAMA CANCER",{"$f":"SUM(C248:C254)","v":0}]
[null,"Test Inmunoquímico de Deposiciones",{"$f":"B!$C$2789","v":0}]
[null,"Yodoterapia",{"$f":"B!$C$2790","v":0}]
[null,"Braquiterapia alta tasa en dosis (HDR)",{"$f":"B!$C$2791","v":0}]
[null,"Braquiterapia baja tasa en dosis (LDR)",{"$f":"B!$C$2792","v":0}]
[null,"Teleterapia de alta complejidad con acelerador lineal (3D)",{"$f":"B!$C$2793","v":0}]
[null,"Teleterapia estándar (3D) con acelerador lineal ",{"$f":"B!$C$2794","v":0}]
[null,"Telecobaltoterapia con acelerador lineal",{"$f":"B!$C$2795","v":0}]
[null,"OTRAS"]
[null,"Otras actividades en cáncer",{"$f":"B!$C$2816","v":0}]
[null,"TOTAL ",{"$f":"SUM(C206+C221+C240+C247+C256)","v":0},{"$f":"SUM(D206+D221+D240+D247+D256)","v":0},{"$f":"SUM(E206+E221+E240+E247,E256)","v":0}]
["SECCIÓN I:TRATAMIENTO ABREVIADO DE LA TUBERCULOSIS"]
["CODIGOS","TRATAMIENTO ABREVIADO DE LA TUBERCULOSIS","TOTAL PRODUCCIÓN","TOTAL BENEFICIARIOS MAI","PAGO POR PRESTACIONES ($)"]
["3003001","TBC, Esquema primario (mensual)",{"$f":"B!$C$2818","v":0},{"$f":"B!$E$2818","v":0},{"$f":"B!$AL$2818","v":0}]
["3003002","TBC, Esquema primario simplificado (mensual)",{"$f":"B!$C$2819","v":0},{"$f":"B!$E$2819","v":0},{"$f":"B!$AL$2819","v":0}]
["3003003","TBC, Esquema secundario (mensual)",{"$f":"B!$C$2820","v":0},{"$f":"B!$E$2820","v":0},{"$f":"B!$AL$2820","v":0}]
["3003004","TBC, Esquema normado de retratamiento (mensual)",{"$f":"B!$C$2821","v":0},{"$f":"B!$E$2821","v":0},{"$f":"B!$AL$2821","v":0}]
["3003005","TBC, Esquema especial de retratamiento (mensual)",{"$f":"B!$C$2822","v":0},{"$f":"B!$E$2822","v":0},{"$f":"B!$AL$2822","v":0}]
[null,"SUB-TOTAL FACTURACION TRATAMIENTO TBC",{"$f":"SUM(C260:C264)","v":0},{"$f":"SUM(D260:D264)","v":0},{"$f":"SUM(E260:E264)","v":0}]
["SECCIÓN J:TRASLADO, RESCATES Y RONDAS RURALES"]
["CODIGOS","TRASLADO, RESCATES Y RONDAS RURALES","TOTAL PRODUCCIÓN","TOTAL BENEFICIARIOS MAI","PAGO POR PRESTACIONES ($)"]
["2401061","Rescate simple y/o traslado en móvil 1",{"$f":"B!$C$2602","v":0},{"$f":"B!$E$2602","v":0},{"$f":"B!$AL$2602","v":0}]
["2401062","Rescate profesionalizado y/o traslado paciente complejo móvil 2",{"$f":"B!$C$2603","v":0},{"$f":"B!$E$2603","v":0},{"$f":"B!$AL$2603","v":0}]
["2401063","Rescate medicalizado y/o traslado paciente critico en móvil 3",{"$f":"B!$C$2604","v":0},{"$f":"B!$E$2604","v":0},{"$f":"B!$AL$2604","v":0}]
["2401064","Traslado en ambulancia",{"$f":"B!$C$2605","v":0},{"$f":"B!$E$2605","v":0},{"$f":"B!$AL$2605","v":0}]
["2401065","Ronda rural terrestre, c/ km recorrido",{"$f":"B!$C$2606","v":0},{"$f":"B!$E$2606","v":0},{"$f":"B!$AL$2606","v":0}]
["2401066","Ronda rural aérea, c/ hora de vuelo",{"$f":"B!$C$2607","v":0},{"$f":"B!$E$2607","v":0},{"$f":"B!$AL$2607","v":0}]
["2401067","Ronda rural marítima, c/ hora de navegación",{"$f":"B!$C$2608","v":0},{"$f":"B!$E$2608","v":0},{"$f":"B!$AL$2608","v":0}]
[null,"SUB-TOTAL FACTURACION TRASLADOS, RESCATES Y RONDAS",{"$f":"SUM(C268:C274)","v":0},{"$f":"SUM(D268:D274)","v":0},{"$f":"SUM(E268:E274)","v":0}]
["SECCION K: PARTOS"]
["CODIGOS","IDENTIFICACION DE PRESTACIONES","TOTAL PRODUCCIÓN","TOTAL BENEFICIARIOS MAI","PAGO POR PRESTACIONES ($)"]
["2004103","Parto normal",{"$f":"B!$C$2277","v":4},{"$f":"B!$E$2277","v":2},{"$f":"B!$AL$2277","v":284000}]
["2004113","Parto distósico vaginal",{"$f":"B!$C$2278","v":4},{"$f":"B!$E$2278","v":2},{"$f":"B!$AL$2278","v":298800}]
[2004003,"Parto (MLE)",{"$f":"B!C2282","v":6}]
[null,"SUB-TOTAL FACTURACION SECCION K",{"$f":"SUM(C278:C279)","v":8},{"$f":"SUM(D278:D279)","v":4},{"$f":"SUM(E278:E279)","v":582800}]
["SECCION L: ATENCION ODONTOLOGICA"]
[null,"Prestaciones","TOTAL PRODUCCIÓN","TOTAL BENEFICIARIOS MAI","PAGO POR PRESTACIONES ($)"]
["2701XXX","Nivel primario                                   ",{"$f":"B!$C$2629","v":0},{"$f":"B!$E$2629","v":0},{"$f":"B!$AL$2629","v":0}]
["2702XXX","Nivel secundario",{"$f":"B!C2666+B!C2688+B!C2689","v":0},{"$f":"B!E2655+B!E2688+B!E2689","v":0},{"$f":"B!$AL$2655+B!AL2688+B!AL2689","v":0}]
["2703XXX","Nivel terciario",{"$f":"B!$C$2692","v":0},{"$f":"B!$H$2692","v":0},{"$f":"B!$AL$2692","v":0}]
[null,"Otras prestaciones odontológicas",{"$f":"B!$C$2742","v":0}]
[null,"Total",{"$f":"SUM(C284:C287)","v":0},{"$f":"SUM(D284:D287)","v":0},{"$f":"SUM(E284:E287)","v":0}]
["SECCIÓN M: HEMODIALISIS"]
["CODIGOS","IDENTIFICACION DE PRESTACIONES","TOTAL PRODUCCIÓN","TOTAL BENEFICIARIOS MAI","PAGO POR PRESTACIONES ($)"]
[1901023,"Hemodiálisis con insumos incluidos",{"$f":"B!$C$2105","v":0},{"$f":"B!$E$2105","v":0},{"$f":"B!$AL$2105","v":0}]
[1901024,"Hemodiálisis sin insumos",{"$f":"B!$C$2106","v":0},{"$f":"B!$E$2106","v":0},{"$f":"B!$AL$2106","v":0}]
["1901025","Peritoneodiálisis (incluye insumos)",{"$f":"B!$C$2107","v":0},{"$f":"B!$E$2107","v":0},{"$f":"B!$AL$2107","v":0}]
["1901026","Peritoneodiálisis continua en paciente crónico (adulto o niños) (tratamiento mensual)",{"$f":"B!$C$2108","v":0},{"$f":"B!$E$2108","v":0},{"$f":"B!$AL$2108","v":0}]
[1901126,"Instalación de cateter para peritoneodiális",{"$f":"B!$C$2109","v":0},{"$f":"B!$E$2109","v":0},{"$f":"B!$AL$2109","v":0}]
["1901027","Hemodialisis, Tratamiento Mensual (con insumos incluidos)",{"$f":"B!$C$2110","v":0},{"$f":"B!$E$2110","v":0},{"$f":"B!$AL$2110","v":0}]
["1901028","Hemodiálisis con bicarbonato con insumos (por sesion)",{"$f":"B!$C$2111","v":0},{"$f":"B!$E$2111","v":0},{"$f":"B!$AL$2111","v":0}]
[1901029,"Hemodiálisis con bicarbonato con insumos (tratamiento mensual)",{"$f":"B!$C$2112","v":0},{"$f":"B!$E$2112","v":0},{"$f":"B!$AL$2112","v":0}]
[null,"SUB-TOTAL FACTURACION SECCION M",{"$f":"SUM(C291:C298)","v":0},{"$f":"SUM(D291:D298)","v":0},{"$f":"SUM(E291:E298)","v":0}]
[]
["SECCIÓN N: TRASPLANTES"]
["CODIGOS","IDENTIFICACION DE PRESTACIONES","TOTAL PRODUCCIÓN","TOTAL BENEFICIARIOS MAI","PAGO POR PRESTACIONES ($)"]
[null,"Estudio  receptor donante cadáver ",{"$f":"B!$C$101","v":0}]
[null,"Estudio receptor donante vivo ",{"$f":"B!$C$102","v":0}]
[null,"Estudio receptores corazón-pulmón ",{"$f":"B!$C$103","v":0}]
[null,"Estudio pacientes trasplante medula ósea ",{"$f":"B!$C$104","v":0}]
[null,"Trasplante de medula autólogo",{"$f":"B!$C$105","v":0}]
[null,"Trasplante de medula alógeno",{"$f":"B!$C$106","v":0}]
[null,"Trasplante medula de cordón",{"$f":"B!$C$107","v":0}]
[null,"Trasplante medula aploidentico",{"$f":"B!$C$108","v":0}]
[null,"Trasplante de córnea (incluye procuramiento y seguimiento por un año)",{"$f":"B!$C$109","v":0}]
[null,"Soporte pretransplante hepático extracorporeo por sesión ",{"$f":"B!$C$110","v":0}]
[1802100,"Trasplante hepático (prestaciones contenidas en sección D)",{"$f":"B!$C$1992","v":0}]
[null,"Trasplante corazón",{"$f":"B!$C$1794","v":0}]
[1902003,"Trasplante Renal (prestaciones contenidas en sección D)",{"$f":"B!$C$2117","v":0}]
[null,"Mantención donante cadáver (pulmón, corazón e hígado) (muerte cerebral) ",{"$f":"B!$C$111","v":0}]
[null,"SUB-TOTAL FACTURACION SECCION N",{"$f":"SUM(C303:C316)","v":0}]
["SECCION O: LENTES, AUDIFONOS"]
["CODIGOS","IDENTIFICACION DE PRESTACIONES","TOTAL PRODUCCIÓN","TOTAL BENEFICIARIOS MAI","PAGO POR PRESTACIONES ($)"]
["3001001","Lentes ópticos",{"$f":"B!$C$2745","v":0},{"$f":"B!$E$2745","v":0},{"$f":"B!$AL$2745","v":0}]
["3001002","Audífonos",{"$f":"B!$C$2746","v":0},{"$f":"B!$E$2746","v":0},{"$f":"B!$AL$2746","v":0}]
[null,"SUB-TOTAL FACTURACION, LENTES Y AUDIFONOS",{"$f":"SUM(C320:C321)","v":0},{"$f":"SUM(D320:D321)","v":0},{"$f":"SUM(E320:E321)","v":0}]
["SECCIÓN P: MEDICINA TRANSFUSIONAL"]
["CODIGOS","IDENTIFICACION DE PRESTACIONES","TOTAL BENEFI-CIARIOS","TOTAL BENEFICIARIOS MAI","PAGO POR PRESTACIONES ($)"]
["Grupo 07","Medicina Transfusional",{"$f":"B!$C$945","v":0},{"$f":"B!$E$945","v":0},{"$f":"B!$AL$945","v":0}]
["PARTE II"]
["SECCION A: EXAMENES DE DIAGNOSTICO"]
["TIPO DE EXAMEN",null,"TOTAL","EXAMENES REALIZADOS",null,null,null,"PROCEDENCIA",null,null,"PRODUCCION INTRA HOSPITAL",null,null,"OPERATIVO","COMPRAS REALIZADAS",null,"VENTAS DE SERVICIOS"]
[null,null,null,"TOTAL BENEFICIARIOS","BENEFICIARIOS",null,"NO BENEFICIARIOS","ATENCION CERRADA","ATENCION ABIERTA","EMERGENCIA","POR \nHONORARIOS","POR CONVENIOS","POR\nCONSULTORES\nDE LLAMADA",null,"AL SISTEMA ","EXTRA-SISTEMA"]
[null,null,null,null,"MAI","MLE"]
["TOTAL EXAMENES LABORATORIO",null,{"$f":"+C332+C333+C334+C335+C336+C337+C341+C342+C343+C344","v":168},112,56,56,56,0,0,0,0,0,0,{"$f":"+N332+N333+N334+N335+N336+N337+N341+N342+N343+N344","v":0},0,0,0,{"$f":"IF((C331)<D331,\"ERROR EN PREVISION\",IF((H331+I331+J331)<>C331,\"ERROR EN PROCEDENCIA\",\"\"))","v":"ERROR EN PROCEDENCIA"}]
["I  ","HEMATOLOGICOS",{"$f":"B!C209","v":168},{"$f":"B!D209","v":112},{"$f":"B!E209","v":56},{"$f":"B!F209","v":56},{"$f":"B!G209","v":56},{"$f":"B!AA209","v":0},{"$f":"B!AB209","v":0},{"$f":"B!AC209","v":0},{"$f":"B!AD209","v":0},{"$f":"B!AE209","v":0},{"$f":"B!AF209","v":0},{"$f":"B!AG209","v":0},{"$f":"B!AH209","v":0},{"$f":"B!AI209","v":0},{"$f":"B!AJ209","v":0},{"$f":"IF((C332)<D332,\"ERROR EN PREVISION\",IF((H332+I332+J332)<>C332,\"ERROR EN PROCEDENCIA\",\"\"))","v":"ERROR EN PROCEDENCIA"}]
["II  ","BIOQUIMICOS",{"$f":"B!C271","v":0},{"$f":"B!D271","v":0},{"$f":"B!E271","v":0},{"$f":"B!F271","v":0},{"$f":"B!G271","v":0},{"$f":"B!AA271","v":0},{"$f":"B!AB271","v":0},{"$f":"B!AC271","v":0},{"$f":"B!AD271","v":0},{"$f":"B!AE271","v":0},{"$f":"B!AF271","v":0},{"$f":"B!AG271","v":0},{"$f":"B!AH271","v":0},{"$f":"B!AI271","v":0},{"$f":"B!AJ271","v":0},""]
["III","HORMONALES",{"$f":"B!C310","v":0},{"$f":"B!D310","v":0},{"$f":"B!E310","v":0},{"$f":"B!F310","v":0},{"$f":"B!G310","v":0},{"$f":"B!AA310","v":0},{"$f":"B!AB310","v":0},{"$f":"B!AC310","v":0},{"$f":"B!AD310","v":0},{"$f":"B!AE310","v":0},{"$f":"B!AF310","v":0},{"$f":"B!AG310","v":0},{"$f":"B!AH310","v":0},{"$f":"B!AI310","v":0},{"$f":"B!AJ310","v":0},""]
["IV","GENETICA",{"$f":"B!C317","v":0},{"$f":"B!D317","v":0},{"$f":"B!E317","v":0},{"$f":"B!F317","v":0},{"$f":"B!G317","v":0},{"$f":"B!AA317","v":0},{"$f":"B!AB317","v":0},{"$f":"B!AC317","v":0},{"$f":"B!AD317","v":0},{"$f":"B!AE317","v":0},{"$f":"B!AF317","v":0},{"$f":"B!AG317","v":0},{"$f":"B!AH317","v":0},{"$f":"B!AI317","v":0},{"$f":"B!AJ317","v":0},""]
["V","INMUNOLOGICOS",{"$f":"B!C373","v":0},{"$f":"B!D373","v":0},{"$f":"B!E373","v":0},{"$f":"B!F373","v":0},{"$f":"B!G373","v":0},{"$f":"B!AA373","v":0},{"$f":"B!AB373","v":0},{"$f":"B!AC373","v":0},{"$f":"B!AD373","v":0},{"$f":"B!AE373","v":0},{"$f":"B!AF373","v":0},{"$f":"B!AG373","v":0},{"$f":"B!AH373","v":0},{"$f":"B!AI373","v":0},{"$f":"B!AJ373","v":0},""]
["VI  ","MICROBIOLOGICOS",{"$f":"SUM(C338:C340)","v":0},{"$f":"SUM(D338:D340)","v":0},{"$f":"SUM(E338:E340)","v":0},0,0,0,0,0,0,0,0,0,0,0,0,""]
[null,"a)   BACTERIAS Y HONGOS",{"$f":"B!C410","v":0},{"$f":"B!D410","v":0},{"$f":"B!E410","v":0},{"$f":"B!F410","v":0},{"$f":"B!G410","v":0},{"$f":"B!AA410","v":0},{"$f":"B!AB410","v":0},{"$f":"B!AC410","v":0},{"$f":"B!AD410","v":0},{"$f":"B!AE410","v":0},{"$f":"B!AF410","v":0},{"$f":"B!AG410","v":0},{"$f":"B!AH410","v":0},{"$f":"B!AI410","v":0},{"$f":"B!AJ410","v":0},""]
[null,"b)   PARASITOS",{"$f":"B!C431","v":0},{"$f":"B!D431","v":0},{"$f":"B!E431","v":0},{"$f":"B!F431","v":0},{"$f":"B!G431","v":0},{"$f":"B!AA431","v":0},{"$f":"B!AB431","v":0},{"$f":"B!AC431","v":0},{"$f":"B!AD431","v":0},{"$f":"B!AE431","v":0},{"$f":"B!AF431","v":0},{"$f":"B!AG431","v":0},{"$f":"B!AH431","v":0},{"$f":"B!AI431","v":0},{"$f":"B!AJ431","v":0},""]
[null,"c)   VIRUS",{"$f":"B!C450","v":0},{"$f":"B!D450","v":0},{"$f":"B!E450","v":0},{"$f":"B!F450","v":0},{"$f":"B!G450","v":0},{"$f":"B!AA450","v":0},{"$f":"B!AB450","v":0},{"$f":"B!AC450","v":0},{"$f":"B!AD450","v":0},{"$f":"B!AE450","v":0},{"$f":"B!AF450","v":0},{"$f":"B!AG450","v":0},{"$f":"B!AH450","v":0},{"$f":"B!AI450","v":0},{"$f":"B!AJ450","v":0},""]
["VII","PROCEDIMIENTO O DETERMINACION DIRECTA C/PACIENTE",{"$f":"B!C460","v":0},{"$f":"B!D460","v":0},{"$f":"B!E460","v":0},{"$f":"B!F460","v":0},{"$f":"B!G460","v":0},{"$f":"B!AA460","v":0},{"$f":"B!AB460","v":0},{"$f":"B!AC460","v":0},{"$f":"B!AD460","v":0},{"$f":"B!AE460","v":0},{"$f":"B!AF460","v":0},{"$f":"B!AG460","v":0},{"$f":"B!AH460","v":0},{"$f":"B!AI460","v":0},{"$f":"B!AJ460","v":0},""]
["VIII  ","EX.  DE DEPOSICIONES EXUDADOS. SECREC. Y OTROS LIQ.  ",{"$f":"B!C511","v":0},{"$f":"B!D511","v":0},{"$f":"B!E511","v":0},{"$f":"B!F511","v":0},{"$f":"B!G511","v":0},{"$f":"B!AA511","v":0},{"$f":"B!AB511","v":0},{"$f":"B!AC511","v":0},{"$f":"B!AD511","v":0},{"$f":"B!AE511","v":0},{"$f":"B!AF511","v":0},{"$f":"B!AG511","v":0},{"$f":"B!AH511","v":0},{"$f":"B!AI511","v":0},{"$f":"B!AJ511","v":0},""]
["IX   ","ORINA",{"$f":"B!C541","v":0},{"$f":"B!D541","v":0},{"$f":"B!E541","v":0},{"$f":"B!F541","v":0},{"$f":"B!G541","v":0},{"$f":"B!AA541","v":0},{"$f":"B!AB541","v":0},{"$f":"B!AC541","v":0},{"$f":"B!AD541","v":0},{"$f":"B!AE541","v":0},{"$f":"B!AF541","v":0},{"$f":"B!AG541","v":0},{"$f":"B!AH541","v":0},{"$f":"B!AI541","v":0},{"$f":"B!AJ541","v":0},""]
["X","OTROS EXAMENES DE LABORATORIO",{"$f":"B!C2943","v":0},{"$f":"B!D2943","v":0},{"$f":"B!E2943","v":0},{"$f":"B!F2943","v":0},{"$f":"B!G2943","v":0},{"$f":"B!AA2943","v":0},{"$f":"B!AB2943","v":0},{"$f":"B!AC2943","v":0},{"$f":"B!AD2943","v":0},{"$f":"B!AE2943","v":0},{"$f":"B!AF2943","v":0},{"$f":"B!AG2943","v":0},{"$f":"B!AH2943","v":0},{"$f":"B!AI2943","v":0},{"$f":"B!AJ2943","v":0},""]
["TOTAL EXAMENES IMAGENOLOGIA",null,{"$f":"+C346+C347+C348+C349+C353+C354","v":0},0,0,0,0,0,0,0,0,0,0,0,0,0,0,""]
["I. a)","EX. RADIOLOGICOS SIMPLES",{"$f":"B!C599","v":0},{"$f":"B!D599","v":0},{"$f":"B!E599","v":0},{"$f":"B!F599","v":0},{"$f":"B!G599","v":0},{"$f":"B!AA599","v":0},{"$f":"B!AB599","v":0},{"$f":"B!AC599","v":0},{"$f":"B!AD599","v":0},{"$f":"B!AE599","v":0},{"$f":"B!AF599","v":0},{"$f":"B!AG599","v":0},{"$f":"B!AH599","v":0},{"$f":"B!AI599","v":0},{"$f":"B!AJ599","v":0},""]
["I. b)","EX. RADIOLOGICOS COMPLEJOS",{"$f":"B!C622","v":0},{"$f":"B!D622","v":0},{"$f":"B!E622","v":0},{"$f":"B!F622","v":0},{"$f":"B!G622","v":0},{"$f":"B!AA622","v":0},{"$f":"B!AB622","v":0},{"$f":"B!AC622","v":0},{"$f":"B!AD622","v":0},{"$f":"B!AE622","v":0},{"$f":"B!AF622","v":0},{"$f":"B!AG622","v":0},{"$f":"B!AH622","v":0},{"$f":"B!AI622","v":0},{"$f":"B!AJ622","v":0},""]
["II.","TOMOGRAFIA AXIAL COMP.",{"$f":"B!C649","v":0},{"$f":"B!D649","v":0},{"$f":"B!E649","v":0},{"$f":"B!F649","v":0},{"$f":"B!G649","v":0},{"$f":"B!AA649","v":0},{"$f":"B!AB649","v":0},{"$f":"B!AC649","v":0},{"$f":"B!AD649","v":0},{"$f":"B!AE649","v":0},{"$f":"B!AF649","v":0},{"$f":"B!AG649","v":0},{"$f":"B!AH649","v":0},{"$f":"B!AI649","v":0},{"$f":"B!AJ649","v":0},""]
["III","ULTRASONOGRAFIA",{"$f":"SUM(C350:C352)","v":0},{"$f":"SUM(D350:D352)","v":0},{"$f":"SUM(E350:E352)","v":0},0,0,0,0,0,0,0,0,{"$f":"SUM(N350:N352)","v":0},0,0,0,""]
[null,"Ecotomografias ( Sin Ecografía Obstetr. Y Abdominal )",{"$f":"B!C671-B!C651-B!C652","v":0},{"$f":"B!D671-B!D651-B!D652","v":0},{"$f":"B!E671-B!E651-B!E652","v":0},{"$f":"B!F671-B!F651-B!F652","v":0},{"$f":"B!G671-B!G651-B!G652","v":0},{"$f":"B!AA671-B!AA651-B!AA652","v":0},{"$f":"B!AB671-B!AB651-B!AB652","v":0},{"$f":"B!AC671-B!AC651-B!AC652","v":0},{"$f":"B!AD671-B!AD651-B!AD652","v":0},{"$f":"B!AE671-B!AE651-B!AE652","v":0},{"$f":"B!AF671-B!AF651-B!AF652","v":0},{"$f":"B!AG671-B!AG651-B!AG652","v":0},{"$f":"B!AH671-B!AH651-B!AH652","v":0},{"$f":"B!AI671-B!AI651-B!AI652","v":0},{"$f":"B!AJ671-B!AJ651-B!AJ652","v":0},""]
[null,"Ecografías Obstétricas",{"$f":"B!C651","v":0},{"$f":"B!D651","v":0},{"$f":"B!E651","v":0},{"$f":"B!F651","v":0},{"$f":"B!G651","v":0},{"$f":"B!AA651","v":0},{"$f":"B!AB651","v":0},{"$f":"B!AC651","v":0},{"$f":"B!AD651","v":0},{"$f":"B!AE651","v":0},{"$f":"B!AF651","v":0},{"$f":"B!AG651","v":0},{"$f":"B!AH651","v":0},{"$f":"B!AI651","v":0},{"$f":"B!AJ651","v":0},""]
[null,"Ecotomografias abdominal ",{"$f":"B!C652","v":0},{"$f":"B!D652","v":0},{"$f":"B!E652","v":0},{"$f":"B!F652","v":0},{"$f":"B!G652","v":0},{"$f":"B!AA652","v":0},{"$f":"B!AB652","v":0},{"$f":"B!AC652","v":0},{"$f":"B!AD652","v":0},{"$f":"B!AE652","v":0},{"$f":"B!AF652","v":0},{"$f":"B!AG652","v":0},{"$f":"B!AH652","v":0},{"$f":"B!AI652","v":0},{"$f":"B!AJ652","v":0},""]
["IV","RESONANCIA MAGNÉTICA ",{"$f":"B!C703","v":0},{"$f":"B!D703","v":0},{"$f":"B!E703","v":0},{"$f":"B!F703","v":0},{"$f":"B!G703","v":0},{"$f":"B!AA703","v":0},{"$f":"B!AB703","v":0},{"$f":"B!AC703","v":0},{"$f":"B!AD703","v":0},{"$f":"B!AE703","v":0},{"$f":"B!AF703","v":0},{"$f":"B!AG703","v":0},{"$f":"B!AH703","v":0},{"$f":"B!AI703","v":0},{"$f":"B!AJ703","v":0},""]
[null,"OTROS EXÁMENES DE IMÁGENES",{"$f":"B!C762","v":0},{"$f":"B!D762","v":0},{"$f":"B!E762","v":0},{"$f":"B!F762","v":0},{"$f":"B!G762","v":0},{"$f":"B!AA762","v":0},{"$f":"B!AB762","v":0},{"$f":"B!AC762","v":0},{"$f":"B!AD762","v":0},{"$f":"B!AE762","v":0},{"$f":"B!AF762","v":0},{"$f":"B!AG762","v":0},{"$f":"B!AH762","v":0},{"$f":"B!AI762","v":0},{"$f":"B!AJ762","v":0},""]
["TOMA DE MUESTRAS",null,{"$f":"B!C472","v":0},{"$f":"B!D472","v":0},{"$f":"B!E472","v":0},{"$f":"B!F472","v":0},{"$f":"B!G472","v":0},{"$f":"B!AA472","v":0},{"$f":"B!AB472","v":0},{"$f":"B!AC472","v":0},{"$f":"B!AD472","v":0},{"$f":"B!AE472","v":0},{"$f":"B!AF472","v":0},{"$f":"B!AG472","v":0},{"$f":"B!AH472","v":0},{"$f":"B!AI472","v":0},{"$f":"B!AJ472","v":0},""]
["TOTAL EXAMENES ANATOMIA PATOLOGICA",null,{"$f":"B!C957","v":0},{"$f":"B!D957","v":0},{"$f":"B!E957","v":0},{"$f":"B!F957","v":0},{"$f":"B!G957","v":0},{"$f":"B!AA957","v":0},{"$f":"B!AB957","v":0},{"$f":"B!AC957","v":0},{"$f":"B!AD957","v":0},{"$f":"B!AE957","v":0},{"$f":"B!AF957","v":0},{"$f":"B!AG957","v":0},{"$f":"B!AH957","v":0},{"$f":"B!AI957","v":0},{"$f":"B!AJ957","v":0},""]
["SECCION B:  MEDICINA NUCLEAR Y RADIOTERAPIA"]
["TIPO DE PROCEDIMIENTO",null,"TOTAL","PROCEDIMIENTOS",null,null,null,"PROCEDENCIA",null,null,"PRODUCCION INTRA HOSPITAL",null,null,"OPERATIVO","COMPRAS REALIZADAS",null,"VENTAS DE SERVICIOS"]
[null,null,null,"TOTAL BENEFICIARIOS","BENEFICIARIOS",null,"NO BENEFICIARIOS","ATENCION CERRADA","ATENCION ABIERTA","EMERGENCIA","POR \nHONORARIOS","POR CONVENIOS","POR\nCONSULTORES\nDE LLAMADA",null,"AL SISTEMA ","EXTRA-SISTEMA"]
[null,null,null,null,"MAI","MLE"]
["I) MEDICINA NUCLEAR"]
["A) PROCEDIMIENTOS DIAGNOSTICOS"]
["1) ESTUDIOS ESTATICOS",null,{"$f":"SUM(B!C769,B!C776,B!C780,B!C787,B!C796)","v":0},{"$f":"SUM(B!D769,B!D776,B!D780,B!D787,B!D796)","v":0},{"$f":"SUM(B!E769,B!E776,B!E780,B!E787,B!E796)","v":0},{"$f":"SUM(B!F769,B!F776,B!F780,B!F787,B!F796)","v":0},{"$f":"SUM(B!G769,B!G776,B!G780,B!G787,B!G796)","v":0},{"$f":"SUM(B!AA769,B!AA776,B!AA780,B!AA787,B!AA796)","v":0},{"$f":"SUM(B!AB769,B!AB776,B!AB780,B!AB787,B!AB796)","v":0},{"$f":"SUM(B!AC769,B!AC776,B!AC780,B!AC787,B!AC796)","v":0},{"$f":"SUM(B!AD769,B!AD776,B!AD780,B!AD787,B!AD796)","v":0},{"$f":"SUM(B!AE769,B!AE776,B!AE780,B!AE787,B!AE796)","v":0},{"$f":"SUM(B!AF769,B!AF776,B!AF780,B!AF787,B!AF796)","v":0},{"$f":"SUM(B!AG769,B!AG776,B!AG780,B!AG787,B!AG796)","v":0},{"$f":"SUM(B!AH769,B!AH776,B!AH780,B!AH787,B!AH796)","v":0},{"$f":"SUM(B!AI769,B!AI776,B!AI780,B!AI787,B!AI796)","v":0},{"$f":"SUM(B!AJ769,B!AJ776,B!AJ780,B!AJ787,B!AJ796)","v":0},{"$f":"IF((C363)<D363,\"ERROR EN PREVISION\",IF((H363+I363+J363)<>C363,\"ERROR EN PROCEDENCIA\",\"\"))","v":""}]
["2) ESTUDIOS DINAMICOS",null,{"$f":"SUM(B!C800,B!C804,B!C808,B!C816,B!C819)","v":0},{"$f":"SUM(B!D800,B!D804,B!D808,B!D816,B!D819)","v":0},{"$f":"SUM(B!E800,B!E804,B!E808,B!E816,B!E819)","v":0},{"$f":"SUM(B!F800,B!F804,B!F808,B!F816,B!F819)","v":0},{"$f":"SUM(B!G800,B!G804,B!G808,B!G816,B!G819)","v":0},{"$f":"SUM(B!AA800,B!AA804,B!AA808,B!AA816,B!AA819)","v":0},{"$f":"SUM(B!AB800,B!AB804,B!AB808,B!AB816,B!AB819)","v":0},{"$f":"SUM(B!AC800,B!AC804,B!AC808,B!AC816,B!AC819)","v":0},{"$f":"SUM(B!AD800,B!AD804,B!AD808,B!AD816,B!AD819)","v":0},{"$f":"SUM(B!AE800,B!AE804,B!AE808,B!AE816,B!AE819)","v":0},{"$f":"SUM(B!AF800,B!AF804,B!AF808,B!AF816,B!AF819)","v":0},{"$f":"SUM(B!AG800,B!AG804,B!AG808,B!AG816,B!AG819)","v":0},{"$f":"SUM(B!AH800,B!AH804,B!AH808,B!AH816,B!AH819)","v":0},{"$f":"SUM(B!AI800,B!AI804,B!AI808,B!AI816,B!AI819)","v":0},{"$f":"SUM(B!AJ800,B!AJ804,B!AJ808,B!AJ816,B!AJ819)","v":0},""]
["B) PROCEDIMIENTOS TERAPEUTICOS"]
["1) RADIOISOTOPOS",null,{"$f":"B!C827","v":0},{"$f":"B!D827","v":0},{"$f":"B!E827","v":0},{"$f":"B!F827","v":0},{"$f":"B!G827","v":0},{"$f":"B!AA827","v":0},{"$f":"B!AB827","v":0},{"$f":"B!AC827","v":0},{"$f":"B!AD827","v":0},{"$f":"B!AE827","v":0},{"$f":"B!AF827","v":0},{"$f":"B!AG827","v":0},{"$f":"B!AH827","v":0},{"$f":"B!AI827","v":0},{"$f":"B!AJ827","v":0},""]
["II) RADIOTERAPIA"]
["BRAQUITERAPIA",null,{"$f":"B!C832","v":0},{"$f":"B!D832","v":0},{"$f":"B!E832","v":0},{"$f":"B!F832","v":0},{"$f":"B!G832","v":0},{"$f":"B!AA832","v":0},{"$f":"B!AB832","v":0},{"$f":"B!AC832","v":0},{"$f":"B!AD832","v":0},{"$f":"B!AE832","v":0},{"$f":"B!AF832","v":0},{"$f":"B!AG832","v":0},{"$f":"B!AH832","v":0},{"$f":"B!AI832","v":0},{"$f":"B!AJ832","v":0},""]
["RADIOTERAPIA C/ACELERADOR",null,{"$f":"B!C850","v":0},{"$f":"B!D850","v":0},{"$f":"B!E850","v":0},{"$f":"B!F850","v":0},{"$f":"B!G850","v":0},{"$f":"B!AA850","v":0},{"$f":"B!AB850","v":0},{"$f":"B!AC850","v":0},{"$f":"B!AD850","v":0},{"$f":"B!AE850","v":0},{"$f":"B!AF850","v":0},{"$f":"B!AG850","v":0},{"$f":"B!AH850","v":0},{"$f":"B!AI850","v":0},{"$f":"B!AJ850","v":0},""]
["TELECOBALTOTERAPIA",null,{"$f":"B!C868","v":0},{"$f":"B!D868","v":0},{"$f":"B!E868","v":0},{"$f":"B!F868","v":0},{"$f":"B!G868","v":0},{"$f":"B!AA868","v":0},{"$f":"B!AB868","v":0},{"$f":"B!AC868","v":0},{"$f":"B!AD868","v":0},{"$f":"B!AE868","v":0},{"$f":"B!AF868","v":0},{"$f":"B!AG868","v":0},{"$f":"B!AH868","v":0},{"$f":"B!AI868","v":0},{"$f":"B!AJ868","v":0},""]
["TOTAL PROCEDIMIENTOS",null,{"$f":"SUM(C363+C364+C366+C368+C369+C370)","v":0},{"$f":"SUM(D363+D364+D366+D368+D369+D370)","v":0},0,0,0,0,0,0,0,0,0,0,0,0,0,""]
["SECCION C:  HEMODIALISIS"]
["TIPO DE HEMODIALISIS",null,"TOTAL","PROCEDIMIENTOS",null,null,null,"PROCEDENCIA",null,null,"PRODUCCION INTRA HOSPITAL",null,null,"OPERATIVO","COMPRAS REALIZADAS",null,"VENTAS DE SERVICIOS"]
[null,null,null,"TOTAL BENEFI-CIARIOS","BENEFICIARIOS",null,"NO BENEFI-CIARIOS","ATENCION CERRADA","ATENCION ABIERTA","EMERGENCIA","POR \nHONORARIOS","POR CONVENIOS","POR\nCONSULTORES\nDE LLAMADA",null,"AL SISTEMA ","EXTRA-SISTEMA"]
[null,null,null,null,"MAI","MLE"]
[1901023,"Hemodiálisis con insumos incluidos",{"$f":"B!C2105","v":0},{"$f":"B!D2105","v":0},{"$f":"B!E2105","v":0},{"$f":"B!F2105","v":0},{"$f":"B!G2105","v":0},{"$f":"B!AA2105","v":0},{"$f":"B!AB2105","v":0},{"$f":"B!AC2105","v":0},{"$f":"B!AD2105","v":0},{"$f":"B!AE2105","v":0},{"$f":"B!AF2105","v":0},{"$f":"B!AG2105","v":0},{"$f":"B!AH2105","v":0},{"$f":"B!AI2105","v":0},{"$f":"B!AJ2105","v":0},{"$f":"IF((C376)<D376,\"ERROR EN PREVISION\",IF((H376+I376+J376)<>C376,\"ERROR EN PROCEDENCIA\",\"\"))","v":""}]
[1901024,"Hemodiálisis sin insumos",{"$f":"B!C2106","v":0},{"$f":"B!D2106","v":0},{"$f":"B!E2106","v":0},{"$f":"B!F2106","v":0},{"$f":"B!G2106","v":0},{"$f":"B!AA2106","v":0},{"$f":"B!AB2106","v":0},{"$f":"B!AC2106","v":0},{"$f":"B!AD2106","v":0},{"$f":"B!AE2106","v":0},{"$f":"B!AF2106","v":0},{"$f":"B!AG2106","v":0},{"$f":"B!AH2106","v":0},{"$f":"B!AI2106","v":0},{"$f":"B!AJ2106","v":0},""]
[1901025,"Peritoneodiálisis  (incluye insumos)",{"$f":"B!C2107","v":0},{"$f":"B!D2107","v":0},{"$f":"B!E2107","v":0},{"$f":"B!F2107","v":0},{"$f":"B!G2107","v":0},{"$f":"B!AA2107","v":0},{"$f":"B!AB2107","v":0},{"$f":"B!AC2107","v":0},{"$f":"B!AD2107","v":0},{"$f":"B!AE2107","v":0},{"$f":"B!AF2107","v":0},{"$f":"B!AG2107","v":0},{"$f":"B!AH2107","v":0},{"$f":"B!AI2107","v":0},{"$f":"B!AJ2107","v":0},""]
[1901026,"Peritoneodiálisis continua en paciente crónico (adulto o niños) (tratamiento mensual)",{"$f":"B!C2108","v":0},{"$f":"B!D2108","v":0},{"$f":"B!E2108","v":0},{"$f":"B!F2108","v":0},{"$f":"B!G2108","v":0},{"$f":"B!AA2108","v":0},{"$f":"B!AB2108","v":0},{"$f":"B!AC2108","v":0},{"$f":"B!AD2108","v":0},{"$f":"B!AE2108","v":0},{"$f":"B!AF2108","v":0},{"$f":"B!AG2108","v":0},{"$f":"B!AH2108","v":0},{"$f":"B!AI2108","v":0},{"$f":"B!AJ2108","v":0},""]
[1901126,"Instalación de cateter para peritoneodiális",{"$f":"B!C2109","v":0},{"$f":"B!D2109","v":0},{"$f":"B!E2109","v":0},{"$f":"B!F2109","v":0},{"$f":"B!G2109","v":0},{"$f":"B!AA2109","v":0},{"$f":"B!AB2109","v":0},{"$f":"B!AC2109","v":0},{"$f":"B!AD2109","v":0},{"$f":"B!AE2109","v":0},{"$f":"B!AF2109","v":0},{"$f":"B!AG2109","v":0},{"$f":"B!AH2109","v":0},{"$f":"B!AI2109","v":0},{"$f":"B!AJ2109","v":0},""]
[1901027,"Hemodiálisis, tratamiento mensual (con insumos incluidos)",{"$f":"B!C2110","v":0},{"$f":"B!D2110","v":0},{"$f":"B!E2110","v":0},{"$f":"B!F2110","v":0},{"$f":"B!G2110","v":0},{"$f":"B!AA2110","v":0},{"$f":"B!AB2110","v":0},{"$f":"B!AC2110","v":0},{"$f":"B!AD2110","v":0},{"$f":"B!AE2110","v":0},{"$f":"B!AF2110","v":0},{"$f":"B!AG2110","v":0},{"$f":"B!AH2110","v":0},{"$f":"B!AI2110","v":0},{"$f":"B!AJ2110","v":0},""]
[1901028,"Hemodiálisis con bicarbonato con insumos (por sesion)",{"$f":"B!C2111","v":0},{"$f":"B!D2111","v":0},{"$f":"B!E2111","v":0},{"$f":"B!F2111","v":0},{"$f":"B!G2111","v":0},{"$f":"B!AA2111","v":0},{"$f":"B!AB2111","v":0},{"$f":"B!AC2111","v":0},{"$f":"B!AD2111","v":0},{"$f":"B!AE2111","v":0},{"$f":"B!AF2111","v":0},{"$f":"B!AG2111","v":0},{"$f":"B!AH2111","v":0},{"$f":"B!AI2111","v":0},{"$f":"B!AJ2111","v":0},""]
[1901029,"Hemodiálisis con bicarbonato con insumos (tratamiento mensual)",{"$f":"B!C2112","v":0},{"$f":"B!D2112","v":0},{"$f":"B!E2112","v":0},{"$f":"B!F2112","v":0},{"$f":"B!G2112","v":0},{"$f":"B!AA2112","v":0},{"$f":"B!AB2112","v":0},{"$f":"B!AC2112","v":0},{"$f":"B!AD2112","v":0},{"$f":"B!AE2112","v":0},{"$f":"B!AF2112","v":0},{"$f":"B!AG2112","v":0},{"$f":"B!AH2112","v":0},{"$f":"B!AI2112","v":0},{"$f":"B!AJ2112","v":0},""]
["TOTAL",null,{"$f":"SUM(C376:C383)","v":0},{"$f":"SUM(D376:D383)","v":0},{"$f":"SUM(E376:E383)","v":0},0,0,0,0,0,0,0,0,0,0,0,0,""]
["SECCION D: INTERVENCIONES QUIRURGICAS"]
["TIPO DE INTERVENCION QUIRURGICA",null,"TOTAL PRODUCCIÓN","TOTAL BENEFICIARIOS","INTERVENCIONES QUIRÚRGICAS",null,null,null,null,null,"CIRUGÍAS MENORES","PRODUCCION INTRA HOSPITAL",null,null,"OPERATIVO","COMPRAS REALIZADAS",null,"VENTAS DE SERVICIOS"]
[null,null,null,null,"PRINCIPAL",null,null,"SECUNDARIA"]
[null,null,null,null,"MAI","MLE","NO BENEFI-CIARIOS","MAI","MLE","NO BENEFI-CIARIOS",null,"POR \nHONORARIOS","POR CONVENIOS","POR\nCONSULTORES\nDE LLAMADA",null,"AL SISTEMA ","EXTRA-SISTEMA"]
["I","NEUROCIRUGIA",{"$f":"B!C1129","v":0},{"$f":"B!H1129","v":0},{"$f":"B!I1129","v":0},{"$f":"B!J1129","v":0},{"$f":"B!K1129","v":0},{"$f":"B!L1129","v":0},{"$f":"B!M1129","v":0},{"$f":"B!N1129","v":0},null,{"$f":"B!AD1129","v":0},{"$f":"B!AE1129","v":0},{"$f":"B!AF1129","v":0},{"$f":"B!AG1129","v":0},{"$f":"B!AH1129","v":0},{"$f":"B!AI1129","v":0},{"$f":"B!AJ1129","v":0}]
["II","CIRUGIA OFTALMOLOGICA",{"$f":"B!C1266","v":0},{"$f":"B!H1266","v":0},{"$f":"B!I1266","v":0},{"$f":"B!J1266","v":0},{"$f":"B!K1266","v":0},{"$f":"B!L1266","v":0},{"$f":"B!M1266","v":0},{"$f":"B!N1266","v":0},{"$f":"SUM(B!C1188:'B'!C1193,B!C1197:'B'!C1199,B!C1201:'B'!C1203,B!C1205:'B'!C1207,B!C1209,B!C1211:'B'!C1214,B!C1216:'B'!C1217,B!C1231:'B'!C1232,B!C1246,B!C1248:'B'!C1249,B!C1261:'B'!C1264)","v":0},{"$f":"B!AD1266","v":0},{"$f":"B!AE1266","v":0},{"$f":"B!AF1266","v":0},{"$f":"B!AG1266","v":0},{"$f":"B!AH1266","v":0},{"$f":"B!AI1266","v":0},{"$f":"B!AJ1266","v":0}]
["III","CIRUGIA OTORRINOLOGICA",{"$f":"B!C1408","v":0},{"$f":"B!H1408","v":0},{"$f":"B!I1408","v":0},{"$f":"B!J1408","v":0},{"$f":"B!K1408","v":0},{"$f":"B!L1408","v":0},{"$f":"B!M1408","v":0},{"$f":"B!N1408","v":0},{"$f":"SUM(B!C1333:'B'!C1337,B!C1340,B!C1354:'B'!C1359,B!C1362:'B'!C1363,B!C1370:'B'!C1371,B!C1373:'B'!C1374,B!C1378,B!C1380:'B'!C1381,B!C1388,B!C1391,B!C1394:'B'!C1395,B!C1402)","v":0},{"$f":"B!AD1408","v":0},{"$f":"B!AE1408","v":0},{"$f":"B!AF1408","v":0},{"$f":"B!AG1408","v":0},{"$f":"B!AH1408","v":0},{"$f":"B!AI1408","v":0},{"$f":"B!AJ1408","v":0}]
["IV","CIRUGIA DE CABEZA Y CUELLO",{"$f":"B!C1472","v":0},{"$f":"B!H1472","v":0},{"$f":"B!I1472","v":0},{"$f":"B!J1472","v":0},{"$f":"B!K1472","v":0},{"$f":"B!L1472","v":0},{"$f":"B!M1472","v":0},{"$f":"B!N1472","v":0},{"$f":"SUM(B!C1431,B!C1433:'B'!C1434,B!C1438:'B'!C1439,B!C1441,B!C1465,B!C1467,B!C1470:'B'!C1471)","v":0},{"$f":"B!AD1472","v":0},{"$f":"B!AE1472","v":0},{"$f":"B!AF1472","v":0},{"$f":"B!AG1472","v":0},{"$f":"B!AH1472","v":0},{"$f":"B!AI1472","v":0},{"$f":"B!AJ1472","v":0}]
["V","CIRUGIA PLASTICA Y REPARADORA",{"$f":"B!C1541","v":0},{"$f":"B!H1541","v":0},{"$f":"B!I1541","v":0},{"$f":"B!J1541","v":0},{"$f":"B!K1541","v":0},{"$f":"B!L1541","v":0},{"$f":"B!M1541","v":0},{"$f":"B!N1541","v":0},{"$f":"SUM(B!C1475:'B'!C1481,B!C1486,B!C1488,B!C1499:'B'!C1500,B!C1531,B!C1535:'B'!C1538)","v":0},{"$f":"B!AD1541","v":0},{"$f":"B!AE1541","v":0},{"$f":"B!AF1541","v":0},{"$f":"B!AG1541","v":0},{"$f":"B!AH1541","v":0},{"$f":"B!AI1541","v":0},{"$f":"B!AJ1541","v":0}]
["VI","TEGUMENTOS",{"$f":"B!C1586","v":0},{"$f":"B!H1586","v":0},{"$f":"B!I1586","v":0},{"$f":"B!J1586","v":0},{"$f":"B!K1586","v":0},{"$f":"B!L1586","v":0},{"$f":"B!M1586","v":0},{"$f":"B!N1586","v":0},{"$f":"SUM(B!C1562:'B'!C1584)","v":0},{"$f":"B!AD1586","v":0},{"$f":"B!AE1586","v":0},{"$f":"B!AF1586","v":0},{"$f":"B!AG1586","v":0},{"$f":"B!AH1586","v":0},{"$f":"B!AI1586","v":0},{"$f":"B!AJ1586","v":0}]
["VII","CIRUGIA CARDIOVASCULAR",{"$f":"B!C1804","v":0},{"$f":"B!H1804","v":0},{"$f":"B!I1804","v":0},{"$f":"B!J1804","v":0},{"$f":"B!K1804","v":0},{"$f":"B!L1804","v":0},{"$f":"B!M1804","v":0},{"$f":"B!N1804","v":0},{"$f":"SUM(B!C1748,B!C1759,B!C1760)","v":0},{"$f":"B!AD1804","v":0},{"$f":"B!AE1804","v":0},{"$f":"B!AF1804","v":0},{"$f":"B!AG1804","v":0},{"$f":"B!AH1804","v":0},{"$f":"B!AI1804","v":0},{"$f":"B!AJ1804","v":0}]
["VIII","CIRUGIA DE TORAX",{"$f":"B!C1874","v":0},{"$f":"B!H1874","v":0},{"$f":"B!I1874","v":0},{"$f":"B!J1874","v":0},{"$f":"B!K1874","v":0},{"$f":"B!L1874","v":0},{"$f":"B!M1874","v":0},{"$f":"B!N1874","v":0},{"$f":"B!C1833","v":0},{"$f":"B!AD1874","v":0},{"$f":"B!AE1874","v":0},{"$f":"B!AF1874","v":0},{"$f":"B!AG1874","v":0},{"$f":"B!AH1874","v":0},{"$f":"B!AI1874","v":0},{"$f":"B!AJ1874","v":0}]
["IX","CIRUGIA ABDOMINAL",{"$f":"B!C2036","v":0},{"$f":"B!H2036","v":0},{"$f":"B!I2036","v":0},{"$f":"B!J2036","v":0},{"$f":"B!K2036","v":0},{"$f":"B!L2036","v":0},{"$f":"B!M2036","v":0},{"$f":"B!N2036","v":0},null,{"$f":"B!AD2036","v":0},{"$f":"B!AE2036","v":0},{"$f":"B!AF2036","v":0},{"$f":"B!AG2036","v":0},{"$f":"B!AH2036","v":0},{"$f":"B!AI2036","v":0},{"$f":"B!AJ2036","v":0}]
["X","CIRUGIA PROCTOLOGICA",{"$f":"B!C2075","v":0},{"$f":"B!H2075","v":0},{"$f":"B!I2075","v":0},{"$f":"B!J2075","v":0},{"$f":"B!K2075","v":0},{"$f":"B!L2075","v":0},{"$f":"B!M2075","v":0},{"$f":"B!N2075","v":0},{"$f":"SUM(B!C2039:'B'!C2040,B!C2042,B!C2044,B!C2056,B!C2073)","v":0},{"$f":"B!AD2075","v":0},{"$f":"B!AE2075","v":0},{"$f":"B!AF2075","v":0},{"$f":"B!AG2075","v":0},{"$f":"B!AH2075","v":0},{"$f":"B!AI2075","v":0},{"$f":"B!AJ2075","v":0}]
["XI","CIRUGIA UROLOGICA Y SUPRARRENAL",{"$f":"B!C2198","v":0},{"$f":"B!H2198","v":0},{"$f":"B!I2198","v":0},{"$f":"B!J2198","v":0},{"$f":"B!K2198","v":0},{"$f":"B!L2198","v":0},{"$f":"B!M2198","v":0},{"$f":"B!N2198","v":0},{"$f":"SUM(B!C2192,B!C2196)","v":0},{"$f":"B!AD2198","v":0},{"$f":"B!AE2198","v":0},{"$f":"B!AF2198","v":0},{"$f":"B!AG2198","v":0},{"$f":"B!AH2198","v":0},{"$f":"B!AI2198","v":0},{"$f":"B!AJ2198","v":0}]
["XII","CIRUGIA DE LA MAMA",{"$f":"B!C2233","v":0},{"$f":"B!H2233","v":0},{"$f":"B!I2233","v":0},{"$f":"B!J2233","v":0},{"$f":"B!K2233","v":0},{"$f":"B!L2233","v":0},{"$f":"B!M2233","v":0},{"$f":"B!N2233","v":0},{"$f":"B!C2229","v":0},{"$f":"B!AD2233","v":0},{"$f":"B!AE2233","v":0},{"$f":"B!AF2233","v":0},{"$f":"B!AG2233","v":0},{"$f":"B!AH2233","v":0},{"$f":"B!AI2233","v":0},{"$f":"B!AJ2233","v":0}]
["XIII","CIRUGIA GINECOLOGICA",{"$f":"B!C2268","v":0},{"$f":"B!H2268","v":0},{"$f":"B!I2268","v":0},{"$f":"B!J2268","v":0},{"$f":"B!K2268","v":0},{"$f":"B!L2268","v":0},{"$f":"B!M2268","v":0},{"$f":"B!N2268","v":0},{"$f":"SUM(B!C2255,B!C2264)","v":0},{"$f":"B!AD2268","v":0},{"$f":"B!AE2268","v":0},{"$f":"B!AF2268","v":0},{"$f":"B!AG2268","v":0},{"$f":"B!AH2268","v":0},{"$f":"B!AI2268","v":0},{"$f":"B!AJ2268","v":0}]
["XIV","CIRUGIA OBSTETRICA  ",{"$f":"SUM(C403:C405)","v":14},0,0,0,0,0,0,0,null,{"$f":"SUM(L403:L405)","v":0},0,0,0,0,0,0]
[null,"Cesárea c/s salpingoligadura o salpingectomía",{"$f":"B!C2274","v":6},{"$f":"B!D2274","v":0},{"$f":"B!E2274","v":0},{"$f":"B!F2274","v":0},{"$f":"B!G2274","v":0},{"$f":"B!L2274","v":0},{"$f":"B!M2274","v":0},{"$f":"B!N2274","v":0},null,{"$f":"B!AD2274","v":0},{"$f":"B!AE2274","v":0},{"$f":"B!AF2274","v":0},{"$f":"B!AG2274","v":0},{"$f":"B!AH2274","v":0},{"$f":"B!AI2274","v":0},{"$f":"B!AJ2274","v":0}]
[null,"Cesárea con histerectomía",{"$f":"B!C2275","v":4},{"$f":"B!D2275","v":0},{"$f":"B!E2275","v":0},{"$f":"B!F2275","v":0},{"$f":"B!G2275","v":0},{"$f":"B!L2275","v":0},{"$f":"B!M2275","v":0},{"$f":"B!N2275","v":0},null,{"$f":"B!AD2275","v":0},{"$f":"B!AE2275","v":0},{"$f":"B!AF2275","v":0},{"$f":"B!AG2275","v":0},{"$f":"B!AH2275","v":0},{"$f":"B!AI2275","v":0},{"$f":"B!AJ2275","v":0}]
[null,"Cesárea ",{"$f":"B!C2276","v":4},{"$f":"B!D2276","v":0},{"$f":"B!E2276","v":0},{"$f":"B!F2276","v":0},{"$f":"B!G2276","v":0},{"$f":"B!L2276","v":0},{"$f":"B!M2276","v":0},{"$f":"B!N2276","v":0},null,{"$f":"B!AD2276","v":0},{"$f":"B!AE2276","v":0},{"$f":"B!AF2276","v":0},{"$f":"B!AG2276","v":0},{"$f":"B!AH2276","v":0},{"$f":"B!AI2276","v":0},{"$f":"B!AJ2276","v":0}]
["XV.I","TRAUMATOLOGIA",{"$f":"B!C2509","v":0},{"$f":"B!H2509","v":0},{"$f":"B!I2509","v":0},{"$f":"B!J2509","v":0},{"$f":"B!K2509","v":0},{"$f":"B!L2509","v":0},{"$f":"B!M2509","v":0},{"$f":"B!N2509","v":0},{"$f":"SUM(B!C2304:'B'!C2310,B!C2312,B!C2322:'B'!C2323,B!C2335,B!C2337:'B'!C2340,B!C2390,B!C2392,B!C2395:'B'!C2397,B!C2401:'B'!C2402,B!C2411,B!C2466)","v":0},{"$f":"B!AD2509","v":0},{"$f":"B!AE2509","v":0},{"$f":"B!AF2509","v":0},{"$f":"B!AG2509","v":0},{"$f":"B!AH2509","v":0},{"$f":"B!AI2509","v":0},{"$f":"B!AJ2509","v":0}]
["XVI","ODONTOLOGIA (COD 27-03) Aranc.Fonasa",{"$f":"B!C2692-B!C2688-B!C2689+B!C2665","v":0},{"$f":"B!H2692-B!H2688-B!H2689+B!H2665","v":0},{"$f":"B!I2692-B!I2688-B!I2689+B!I2665","v":0},{"$f":"B!J2692-B!J2688-B!J2689+B!J2665","v":0},{"$f":"B!K2692-B!K2688-B!K2689+B!K2665","v":0},{"$f":"B!L2692-B!L2688-B!L2689+B!L2665","v":0},{"$f":"B!M2692-B!M2688-B!M2689+B!M2665","v":0},{"$f":"B!N2692-B!N2688-B!N2689+B!N2665","v":0},{"$f":"SUM(B!C2668,B!C2673,B!C2675,B!C2678:'B'!C2679,B!C2681:'B'!C2685,B!C2656:'B'!C2664)","v":0},{"$f":"B!AD2692-B!AD2688-B!AD2689+B!AD2665","v":0},{"$f":"B!AE2692-B!AE2688-B!AE2689+B!AE2665","v":0},{"$f":"B!AF2692-B!AF2688-B!AF2689+B!AF2665","v":0},{"$f":"B!AG2692-B!AG2688-B!AG2689+B!AG2665","v":0},{"$f":"B!AH2692-B!AH2688-B!AH2689+B!AH2665","v":0},{"$f":"B!AI2692-B!AI2688-B!AI2689+B!AI2665","v":0},{"$f":"B!AJ2692-B!AJ2688-B!AJ2689+B!AJ2665","v":0}]
["XVI","RETIRO ELEMENTOS OSTEOSINTESIS",{"$f":"B!C2521","v":0},{"$f":"B!H2521","v":0},{"$f":"B!I2521","v":0},{"$f":"B!J2521","v":0},{"$f":"B!K2521","v":0},{"$f":"B!L2521","v":0},{"$f":"B!M2521","v":0},{"$f":"B!N2521","v":0},null,{"$f":"B!AD2521","v":0},{"$f":"B!AE2521","v":0},{"$f":"B!AF2521","v":0},{"$f":"B!AG2521","v":0},{"$f":"B!AH2521","v":0},{"$f":"B!AI2521","v":0},{"$f":"B!AJ2521","v":0}]
["TOTAL INTERVENCIONES QUIRURGICAS",null,{"$f":"SUM(C389:C401)+C406+C407+C408","v":0},0,0,0,0,{"$f":"SUM(H389:H401)+H406+H407+H408","v":0},0,0,0,0,0,0,0,0,0,0]
["SECCIÓN E: INTERVENCIONES QUIRÚRGICAS POR TIPO DE INTERVENCIÓN "]
["TIPO DE INTERVENCIÓN",null,"TOTAL","BENEFICIARIOS MAI","< 15 AÑOS","15 AÑOS Y MAS","COMPRAS REALIZADAS AL SISTEMA ","COMPRAS REALIZADAS AL SISTEMA","COMPRAS REALIZADAS AL EXTRA-SISTEMA","COMPRAS REALIZADAS AL EXTRA-SISTEMA"]
[null,null,null,null,null,null,"< 15 AÑOS","15 AÑOS Y MAS","< 15 AÑOS","15 AÑOS Y MAS"]
["ELECTIVAS MAYORES NO AMBULATORIAS ",null,{"$f":"SUM(E413,F413)","v":12},null,{"$f":"SUM(B!P1129,B!P1266,B!P1408,B!P1472,B!P1541,B!P1586,B!P1791,B!P1803,B!P1874,B!P2036,B!P2075,B!P2198,B!P2233,B!P2268,B!P2279,B!P2516,B!P2521,B!P2666,B!P2692)","v":6},{"$f":"SUM(B!Q1129,B!Q1266,B!Q1408,B!Q1472,B!Q1541,B!Q1586,B!Q1791,B!Q1803,B!Q1874,B!Q2036,B!Q2075,B!Q2198,B!Q2233,B!Q2268,B!Q2279,B!Q2516,B!Q2521,B!Q2666,B!Q2692)","v":6},null,null,null,null,{"$f":"AA413","v":""},null,null,null,null,null,null,null,null,null,null,null,null,null,null,null,{"$f":"IF(C413<D413,\"Beneficiarios MAI no puede ser mayor al TOTAL\",\"\")","v":""},{"$f":"IF(C413<D413,1,0)","v":0}]
["ELECTIVAS MAYORES AMBULATORIAS ",null,{"$f":"SUM(E414,F414)","v":12},null,{"$f":"SUM(B!S1129,B!S1266,B!S1408,B!S1472,B!S1541,B!S1586,B!S1791,B!S1803,B!S1874,B!S2036,B!S2075,B!S2198,B!S2233,B!S2268,B!S2279,B!S2516,B!S2521,B!S2666,B!S2692)","v":6},{"$f":"SUM(B!T1129,B!T1266,B!T1408,B!T1472,B!T1541,B!T1586,B!T1791,B!T1803,B!T1874,B!T2036,B!T2075,B!T2198,B!T2233,B!T2268,B!T2279,B!T2516,B!T2521,B!T2666,B!T2692)","v":6},null,null,null,null,{"$f":"AA414","v":""},null,null,null,null,null,null,null,null,null,null,null,null,null,null,null,{"$f":"IF(C414<D414,\"Beneficiarios MAI no puede ser mayor al TOTAL\",\"\")","v":""},{"$f":"IF(C414<D414,1,0)","v":0}]
["URGENCIA","MAYOR NO AMBULATORIAS",{"$f":"SUM(E415,F415)","v":0},null,{"$f":"SUM(B!Y1129,B!Y1266,B!Y1408,B!Y1472,B!Y1541,B!Y1586,B!Y1791,B!Y1803,B!Y1874,B!Y2036,B!Y2075,B!Y2198,B!Y2233,B!Y2268,B!Y2279,B!Y2516,B!Y2521,B!Y2666,B!Y2692)","v":0},{"$f":"SUM(B!Z1129,B!Z1266,B!Z1408,B!Z1472,B!Z1541,B!Z1586,B!Z1791,B!Z1803,B!Z1874,B!Z2036,B!Z2075,B!Z2198,B!Z2233,B!Z2268,B!Z2279,B!Z2516,B!Z2521,B!Z2666,B!Z2692)","v":0},null,null,null,null,{"$f":"AA415","v":""},null,null,null,null,null,null,null,null,null,null,null,null,null,null,null,{"$f":"IF(C415<D415,\"Beneficiarios MAI no puede ser mayor al TOTAL\",\"\")","v":""},{"$f":"IF(C415<D415,1,0)","v":0}]
[null,"MAYOR AMBULATORIAS",{"$f":"SUM(E416,F416)","v":0},null,{"$f":"SUM(B!V1129,B!V1266,B!V1408,B!V1472,B!V1541,B!V1586,B!V1791,B!V1803,B!V1874,B!V2036,B!V2075,B!V2198,B!V2233,B!V2268,B!V2279,B!V2516,B!V2521,B!V2666,B!V2692)","v":0},{"$f":"SUM(B!W1129,B!W1266,B!W1408,B!W1472,B!W1541,B!W1586,B!W1791,B!W1803,B!W1874,B!W2036,B!W2075,B!W2198,B!W2233,B!W2268,B!W2279,B!W2516,B!W2521,B!W2666,B!W2692)","v":0},null,null,null,null,{"$f":"AA416","v":""},null,null,null,null,null,null,null,null,null,null,null,null,null,null,null,{"$f":"IF(C416<D416,\"Beneficiarios MAI no puede ser mayor al TOTAL\",\"\")","v":""},{"$f":"IF(C416<D416,1,0)","v":0}]
["SECCIÓN F:  AMPUTACIÓN POR PIE DIABÉTICO"]
["TIPO DE INTERVENCIÓN QUIRÚRGICA",null,"TOTAL PRODUCCIÓN","TOTAL BENEFICIARIOS MAI"]
[]
["AMPUTACIÓN DE ORTEJO(S) POR PIE DIABETICO",null,{"$f":"B!C2513","v":0},{"$f":"B!H2513","v":0}]
["AMPUTACIÓN DE PIE COMPLETO POR PIE DIABETICO",null,{"$f":"B!C2514+B!C2512","v":0},{"$f":"B!H2514+B!H2512","v":0}]
["SECCIÓN G:PROCEDIMIENTOS MEDICOS DE DIAGNÓSTICO Y TERAPÉUTICOS"]
["TIPO DE PROCEDIMIENTO",null,"TOTAL","PROCEDIMIENTOS",null,null,null,"PROCEDENCIA",null,null,"PRODUCCION INTRA HOSPITAL",null,null,"OPERATIVO","COMPRAS REALIZADAS",null,"VENTAS DE SERVICIOS"]
[null,null,null,"TOTAL BENEFICIARIOS","BENEFICIARIOS",null,"NO BENEFI-CIARIOS","ATENCION CERRADA","ATENCION ABIERTA","EMERGENCIA","POR \nHONO-\nRARIOS","POR CONVENIOS","POR\nCONSULTORES\nDE LLAMADA",null,"AL SISTEMA ","EXTRA-SISTEMA"]
[null,null,null,null,"MAI","MLE"]
[" DE\n NEUROLOGÍA","MODALIDAD ARANCEL INSTITUCIONAL",{"$f":"B!C1003","v":0},{"$f":"B!D1003","v":0},{"$f":"B!E1003","v":0},{"$f":"B!F1003","v":0},{"$f":"B!G1003","v":0},{"$f":"B!AA1003","v":0},{"$f":"B!AB1003","v":0},{"$f":"B!AC1003","v":0},{"$f":"B!AD1003","v":0},{"$f":"B!AE1003","v":0},{"$f":"B!AF1003","v":0},{"$f":"B!AG1003","v":0},{"$f":"B!AH1003","v":0},{"$f":"B!AI1003","v":0},{"$f":"B!AJ1003","v":0},{"$f":"IF((C426)<D426,\"ERROR EN PREVISION\",IF((H426+I426+J426)<>C426,\"ERROR EN PROCEDENCIA\",\"\"))","v":""}]
[null,"MODALIDAD LIBRE ELECCIÓN + LO NO ARANCELADO",{"$f":"B!C1057","v":0},{"$f":"B!D1057","v":0},{"$f":"B!E1057","v":0},{"$f":"B!F1057","v":0},{"$f":"B!G1057","v":0},{"$f":"B!AA1057","v":0},{"$f":"B!AB1057","v":0},{"$f":"B!AC1057","v":0},{"$f":"B!AD1057","v":0},{"$f":"B!AE1057","v":0},{"$f":"B!AF1057","v":0},{"$f":"B!AG1057","v":0},{"$f":"B!AH1057","v":0},{"$f":"B!AI1057","v":0},{"$f":"B!AJ1057","v":0},{"$f":"IF((C427)<D427,\"ERROR EN PREVISION\",IF((H427+I427+J427)<>C427,\"ERROR EN PROCEDENCIA\",\"\"))","v":""}]
[null,"TOTAL",{"$f":"SUM(C426:C427)","v":0},{"$f":"SUM(D426:D427)","v":0},{"$f":"SUM(E426:E427)","v":0},0,0,0,0,0,0,0,0,null,0,0,0]
[" DE OFTALMOLOGÍA","MODALIDAD LIBRE ELECCIÓN + LO NO ARANCELADO",{"$f":"B!C1186","v":0},{"$f":"B!D1186","v":0},{"$f":"B!E1186","v":0},{"$f":"B!F1186","v":0},{"$f":"B!G1186","v":0},{"$f":"B!AA1186","v":0},{"$f":"B!AB1186","v":0},{"$f":"B!AC1186","v":0},{"$f":"B!AD1186","v":0},{"$f":"B!AE1186","v":0},{"$f":"B!AF1186","v":0},{"$f":"B!AG1186","v":0},{"$f":"B!AH1186","v":0},{"$f":"B!AI1186","v":0},{"$f":"B!AJ1186","v":0},""]
[" DE OTORRINOLARINGOLOGÍA","MODALIDAD LIBRE ELECCIÓN + LO NO ARANCELADO",{"$f":"B!C1331","v":0},{"$f":"B!D1331","v":0},{"$f":"B!E1331","v":0},{"$f":"B!F1331","v":0},{"$f":"B!G1331","v":0},{"$f":"B!AA1331","v":0},{"$f":"B!AB1331","v":0},{"$f":"B!AC1331","v":0},{"$f":"B!AD1331","v":0},{"$f":"B!AE1331","v":0},{"$f":"B!AF1331","v":0},{"$f":"B!AG1331","v":0},{"$f":"B!AH1331","v":0},{"$f":"B!AI1331","v":0},{"$f":"B!AJ1331","v":0},""]
[" DE CABEZA Y CUELLO ","MODALIDAD ARANCEL INSTITUCIONAL",{"$f":"B!C1411","v":0},{"$f":"B!D1411","v":0},{"$f":"B!E1411","v":0},{"$f":"B!F1411","v":0},{"$f":"B!G1411","v":0},{"$f":"B!AA1411","v":0},{"$f":"B!AB1411","v":0},{"$f":"B!AC1411","v":0},{"$f":"B!AD1411","v":0},{"$f":"B!AE1411","v":0},{"$f":"B!AF1411","v":0},{"$f":"B!AG1411","v":0},{"$f":"B!AH1411","v":0},{"$f":"B!AI1411","v":0},{"$f":"B!AJ1411","v":0},""]
[" DE DERMATOLOGÍA","MODALIDAD LIBRE ELECCIÓN + LO NO ARANCELADO",{"$f":"B!C1559","v":0},{"$f":"B!D1559","v":0},{"$f":"B!E1559","v":0},{"$f":"B!F1559","v":0},{"$f":"B!G1559","v":0},{"$f":"B!AA1559","v":0},{"$f":"B!AB1559","v":0},{"$f":"B!AC1559","v":0},{"$f":"B!AD1559","v":0},{"$f":"B!AE1559","v":0},{"$f":"B!AF1559","v":0},{"$f":"B!AG1559","v":0},{"$f":"B!AH1559","v":0},{"$f":"B!AI1559","v":0},{"$f":"B!AJ1559","v":0},""]
[" DE CARDIOLOGÍA Y NEUMOLOGÍA","MODALIDAD ARANCEL INSTITUCIONAL",{"$f":"B!C1721","v":0},{"$f":"B!D1721","v":0},{"$f":"B!E1721","v":0},{"$f":"B!F1721","v":0},{"$f":"B!G1721","v":0},{"$f":"B!AA1721","v":0},{"$f":"B!AB1721","v":0},{"$f":"B!AC1721","v":0},{"$f":"B!AD1721","v":0},{"$f":"B!AE1721","v":0},{"$f":"B!AF1721","v":0},{"$f":"B!AG1721","v":0},{"$f":"B!AH1721","v":0},{"$f":"B!AI1721","v":0},{"$f":"B!AJ1721","v":0},""]
[null,"MODALIDAD LIBRE ELECCIÓN + LO NO ARANCELADO",{"$f":"B!C1695+B!C1723","v":0},{"$f":"B!D1695+B!D1723","v":0},{"$f":"B!E1695+B!E1723","v":0},{"$f":"B!F1695+B!F1723","v":0},{"$f":"B!G1695+B!G1723","v":0},{"$f":"B!AA1695+B!AA1723","v":0},{"$f":"B!AB1695+B!AB1723","v":0},{"$f":"B!AC1695+B!AC1723","v":0},{"$f":"B!AD1695+B!AD1723","v":0},{"$f":"B!AE1695+B!AE1723","v":0},{"$f":"B!AF1695+B!AF1723","v":0},{"$f":"B!AG1695+B!AG1723","v":0},{"$f":"B!AH1695+B!AH1723","v":0},{"$f":"B!AI1695+B!AI1723","v":0},{"$f":"B!AJ1695+B!AJ1723","v":0},""]
[null,"TOTAL",{"$f":"SUM(C433:C434)","v":0},0,0,0,0,0,0,0,0,0,0,null,0,0,0]
[" DE GASTRO\nENTEROLOGÍA","MODALIDAD ARANCEL INSTITUCIONAL",{"$f":"B!C1944","v":0},{"$f":"B!D1944","v":0},{"$f":"B!E1944","v":0},{"$f":"B!F1944","v":0},{"$f":"B!G1944","v":0},{"$f":"B!AA1944","v":0},{"$f":"B!AB1944","v":0},{"$f":"B!AC1944","v":0},{"$f":"B!AD1944","v":0},{"$f":"B!AE1944","v":0},{"$f":"B!AF1944","v":0},{"$f":"B!AG1944","v":0},{"$f":"B!AH1944","v":0},{"$f":"B!AI1944","v":0},{"$f":"B!AJ1944","v":0},""]
[null,"MODALIDAD LIBRE ELECCIÓN + LO NO ARANCELADO",{"$f":"B!C1938","v":0},{"$f":"B!D1938","v":0},{"$f":"B!E1938","v":0},{"$f":"B!F1938","v":0},{"$f":"B!G1938","v":0},{"$f":"B!AA1938","v":0},{"$f":"B!AB1938","v":0},{"$f":"B!AC1938","v":0},{"$f":"B!AD1938","v":0},{"$f":"B!AE1938","v":0},{"$f":"B!AF1938","v":0},{"$f":"B!AG1938","v":0},{"$f":"B!AH1938","v":0},{"$f":"B!AI1938","v":0},{"$f":"B!AJ1938","v":0},""]
[null,"TOTAL",{"$f":"SUM(C436:C437)","v":0},0,0,0,0,0,0,0,0,0,0,null,0,0,0]
[" DE UROLOGÍA Y NEFROLOGÍA","MODALIDAD LIBRE ELECCIÓN + LO NO ARANCELADO",{"$f":"B!C2102","v":0},{"$f":"B!D2102","v":0},{"$f":"B!E2102","v":0},{"$f":"B!F2102","v":0},{"$f":"B!G2102","v":0},{"$f":"B!AA2102","v":0},{"$f":"B!AB2102","v":0},{"$f":"B!AC2102","v":0},{"$f":"B!AD2102","v":0},{"$f":"B!AE2102","v":0},{"$f":"B!AF2102","v":0},{"$f":"B!AG2102","v":0},{"$f":"B!AH2102","v":0},{"$f":"B!AI2102","v":0},{"$f":"B!AJ2102","v":0},""]
[" DE GINECOLOGÍA OBSTETRICIA ","MODALIDAD ARANCEL INSTITUCIONAL (SE INCLUYEN ABORTOS)",{"$f":"B!C2218+B!C2270+B!C2271","v":0},{"$f":"B!D2218+B!D2270+B!D2271","v":0},{"$f":"B!E2218+B!E2270+B!E2271","v":0},{"$f":"B!F2218+B!F2270+B!F2271","v":0},{"$f":"B!G2218+B!G2270+B!G2271","v":0},{"$f":"B!AA2218+B!AA2270+B!AA2271","v":0},{"$f":"B!AB2218+B!AB2270+B!AB2271","v":0},{"$f":"B!AC2218+B!AC2270+B!AC2271","v":0},{"$f":"B!AD2218+B!AD2270+B!AD2271","v":0},{"$f":"B!AE2218+B!AE2270+B!AE2271","v":0},{"$f":"B!AF2218+B!AF2270+B!AF2271","v":0},{"$f":"B!AG2218+B!AG2270+B!AG2271","v":0},{"$f":"B!AH2218+B!AH2270+B!AH2271","v":0},{"$f":"B!AI2218+B!AI2270+B!AI2271","v":0},{"$f":"B!AJ2218+B!AJ2270+B!AJ2271","v":0},""]
[null,"MODALIDAD LIBRE ELECCIÓN + LO NO ARANCELADO",{"$f":"B!C2226","v":0},{"$f":"B!D2226","v":0},{"$f":"B!E2226","v":0},{"$f":"B!F2226","v":0},{"$f":"B!G2226","v":0},{"$f":"B!AA2226","v":0},{"$f":"B!AB2226","v":0},{"$f":"B!AC2226","v":0},{"$f":"B!AD2226","v":0},{"$f":"B!AE2226","v":0},{"$f":"B!AF2226","v":0},{"$f":"B!AG2226","v":0},{"$f":"B!AH2226","v":0},{"$f":"B!AI2226","v":0},{"$f":"B!AJ2226","v":0},""]
[null,"TOTAL",{"$f":"SUM(C440:C441)","v":0},{"$f":"SUM(D440:D441)","v":0},0,0,0,0,0,0,0,0,0,0,0,0,0]
[" DE TRAUMATOLOGÍA","MODALIDAD ARANCEL INSTITUCIONAL",{"$f":"B!C2533","v":0},{"$f":"B!D2533","v":0},{"$f":"B!E2533","v":0},{"$f":"B!F2533","v":0},{"$f":"B!G2533","v":0},{"$f":"B!AA2533","v":0},{"$f":"B!AB2533","v":0},{"$f":"B!AC2533","v":0},{"$f":"B!AD2533","v":0},{"$f":"B!AE2533","v":0},{"$f":"B!AF2533","v":0},{"$f":"B!AG2533","v":0},{"$f":"B!AH2533","v":0},{"$f":"B!AI2533","v":0},{"$f":"B!AJ2533","v":0},""]
[null,"MODALIDAD LIBRE ELECCIÓN + LO NO ARANCELADO",{"$f":"B!C2302","v":0},{"$f":"B!D2302","v":0},{"$f":"B!E2302","v":0},{"$f":"B!F2302","v":0},{"$f":"B!G2302","v":0},{"$f":"B!AA2302","v":0},{"$f":"B!AB2302","v":0},{"$f":"B!AC2302","v":0},{"$f":"B!AD2302","v":0},{"$f":"B!AE2302","v":0},{"$f":"B!AF2302","v":0},{"$f":"B!AG2302","v":0},{"$f":"B!AH2302","v":0},{"$f":"B!AI2302","v":0},{"$f":"B!AJ2302","v":0},""]
[null,"TOTAL",{"$f":"SUM(C443:C444)","v":0},0,0,0,0,0,0,0,0,0,0,null,0,0,0]
["OTROS PROCEDIMIENTOS ","MODALIDAD LIBRE ELECCIÓN + LO NO ARANCELADO",{"$f":"B!C929","v":0},{"$f":"B!D929","v":0},{"$f":"B!E929","v":0},{"$f":"B!F929","v":0},{"$f":"B!G929","v":0},{"$f":"B!AA929","v":0},{"$f":"B!AB929","v":0},{"$f":"B!AC929","v":0},{"$f":"B!AD929","v":0},{"$f":"B!AE929","v":0},{"$f":"B!AF929","v":0},{"$f":"B!AG929","v":0},{"$f":"B!AH929","v":0},{"$f":"B!AI929","v":0},{"$f":"B!AJ929","v":0},""]
["TOTAL PROCEDIMIENTOS MEDICOS","MODALIDAD ARANCEL INSTITUCIONAL",{"$f":"D447+G447","v":0},{"$f":"+D426+D431+D433+D436+D440+D443","v":0},{"$f":"+E426+E431+E433+E436+E440+E443","v":0},{"$f":"+F426+F431+F433+F436+F440+F443","v":0},{"$f":"+G426+G431+G433+G436+G440+G443","v":0},{"$f":"+H426+H431+H433+H436+H440+H443","v":0},0,0,0,0,0,0,0,0,0,""]
[null,"MODALIDAD LIBRE ELECCIÓN + LO NO ARANCELADO",{"$f":"D448+G448","v":0},{"$f":"+D427+D429+D430+D432+D434+D437+D439+D444+D446","v":0},{"$f":"+E427+E429+E430+E432+E434+E437+E439+E444+E446","v":0},{"$f":"+F427+F429+F430+F432+F434+F437+F439+F444+F446","v":0},{"$f":"+G427+G429+G430+G432+G434+G437+G439+G444+G446","v":0},{"$f":"+H427+H429+H430+H432+H434+H437+H439+H444+H446","v":0},0,0,0,0,0,0,0,0,0,""]
[null,"TOTAL PRODUCCION",{"$f":"SUM(C447:C448)","v":0},{"$f":"SUM(D447:D448)","v":0},{"$f":"SUM(E447:E448)","v":0},{"$f":"SUM(F447:F448)","v":0},{"$f":"SUM(G447:G448)","v":0},{"$f":"SUM(H447:H448)","v":0},0,0,0,0,0,0,0,0,0]
["SECCION H:  MISCELANEOS"]
["TIPO DE PRESTACIÓN",null,"TOTAL","TOTAL BENEFICIARIOS MAI"]
["OTRAS PRESTACIONES PSIQUIATRICAS",null,{"$f":"B!C980","v":0},{"$f":"B!E980","v":0}]
["ANESTESIA EPIDURAL  (PARTOS)",null,{"$f":"B!C2591","v":0},{"$f":"B!E2591","v":0}]
["OTROS PROCEDIMIENTOS ANESTÉSICOS",null,{"$f":"B!C2600","v":0},{"$f":"B!E2600","v":0}]
["CURACION SIMPLE AMBULATORIA",null,{"$f":"B!C65","v":0},{"$f":"B!E65","v":0}]
["PROCEDIMIENTO DE PODOLOGÍA",null,{"$f":"B!C71","v":0},{"$f":"B!E71","v":0}]
["AUTOCUIDADO PACIENTES DID",null,{"$f":"B!C66","v":0},{"$f":"B!E66","v":0}]
["OXIGENOTERAPIA DOMICILIO",null,{"$f":"B!C67","v":0},{"$f":"B!E67","v":0}]
["ABREU",null,{"$f":"B!C69","v":0},{"$f":"B!E69","v":0}]
["DESPACHO DE RECETAS A CRÓNICOS",null,{"$f":"B!C68","v":0},{"$f":"B!E68","v":0}]
["PROTESIS Y ÓRTESIS",null,{"$f":"B!C2588","v":0},{"$f":"B!E2588","v":0}]
["TOTAL MISCELANEOS",null,{"$f":"SUM(C452:C461)","v":0},{"$f":"SUM(D452:D461)","v":0}]
["SECCIÓN I: PRESCRIPCIONES ADMINISTRADAS EN URGENCIA APS"]
["ATENCIÓN",null,"TOTAL"]
["URGENCIA SAPU/SAR"]
["SECCIÓN J: ACTIVIDADES EN UNIDAD DE FARMACIA HOSPITALARIA"]
[null,null,"TOTAL"]
["Nº DE PREPARADOS FARMACEUTICOS","ESTERILES"]
[null,"NO ESTERILES"]
["Nº DE DOSIS UNITARIA PREPARADAS"]
["SECCIÓN K: OTRAS ATENCIONES A PACIENTES AMBULATORIOS"]
["TIPO DE ATENCIÓN",null,"TOTAL ","ATENCIONES POR EDAD",null,null,null,null,null,"BENEFICIARIOS"]
[null,null,null,"< 1 año","1 - 4 años","5 a 9 años","10 a 19 años","20 a 64 años","65 años y más"]
["POR TERAPÉUTICA OCUPACIONAL",null,{"$f":"SUM(D474:I474)","v":0},null,null,null,null,null,null,null,{"$f":"AA474","v":""},null,null,null,null,null,null,null,null,null,null,null,null,null,null,null,{"$f":"IF(J474>C474,\"Error: Las actividades totales son menores que las realizadas en beneficiarios\",\"\")","v":""},{"$f":"IF(J474>C474,1,0)","v":0}]
["POR KINESIOLOGO (NO SAPU)",null,{"$f":"SUM(D475:I475)","v":0},null,null,null,null,null,null,null,{"$f":"AA475","v":""},null,null,null,null,null,null,null,null,null,null,null,null,null,null,null,{"$f":"IF(J475>C475,\"Error: Las actividades totales son menores que las realizadas en beneficiarios\",\"\")","v":""},{"$f":"IF(J475>C475,1,0)","v":0}]
["POR EDUCADORA DE PÁRVULO/DIFERENCIAL",null,{"$f":"SUM(D476:E476)","v":0},null,null,null,null,null,null,null,{"$f":"AA476","v":""},null,null,null,null,null,null,null,null,null,null,null,null,null,null,null,{"$f":"IF(J476>C476,\"Error: Las actividades totales son menores que las realizadas en beneficiarios\",\"\")","v":""},{"$f":"IF(J476>C476,1,0)","v":0}]
["SECCIÓN L: OTROS TRASLADOS DE PACIENTES"]
["TIPO DE ACCIÓN",null,"TOTAL","A \nBENE-\nFICIARIOS","POR COMPRA \nDE SERVICIO",null,null,null,null,null,null," "]
["TRASLADOS NO DE URGENCIA","AMBULANCIA",null,null,null,{"$f":"AA479","v":""},null,null,null,null,null,null,null,null,null,null,null,null,null,null,null,null,null,null,null,null,{"$f":"IF(D479>C479,\"Error: Las actividades totales son menores que las realizadas en beneficiarios\",\"\")","v":""},{"$f":"IF(D479>C479,1,0)","v":0}]
[null,"MARÍTIMO",null,null,null,{"$f":"AA480","v":""},null,null,null,null,null,null,null,null,null,null,null,null,null,null,null,null,null,null,null,null,{"$f":"IF(D480>C480,\"Error: Las actividades totales son menores que las realizadas en beneficiarios\",\"\")","v":""},{"$f":"IF(D480>C480,1,0)","v":0}]
[null,"AÉREO",null,null,null,{"$f":"AA481","v":""},null,null,null,null,null,null,null,null,null,null,null,null,null,null,null,null,null,null,null,null,{"$f":"IF(D481>C481,\"Error: Las actividades totales son menores que las realizadas en beneficiarios\",\"\")","v":""},{"$f":"IF(D481>C481,1,0)","v":0}]
["SECCIÓN M:EXAMENES DE TAMIZAJE POINT OF CARE (SAR)"]
["TAMIZAJE",null,"TOTAL "]
["Cartridge para Troponina",null,{"$f":"B!C2941","v":0}]
["Cartridge Multiple",null,{"$f":"B!C2942","v":0}]
[]
["SECCIÓN N: ENTREGA DE AYUDAS TÉCNICAS GES Y NO GES A PERSONAS  EN EL ESTABLECIMIENTO"]
["AYUDA TÉCNICA",null,"TOTAL DE ENTREGA\n< 65 años","TOTAL DE ENTREGA\n> 65 años"]
["BASTÓN"]
["ANDADOR"]
["ANDADOR DE PASILLO"]
["COJÍN ANTIESCARAS"]
["COLCHÓN ANTIESCARA"]
["SILLA DE RUEDAS"]
["LENTES POR PRESBICIA"]
[]
["SECCIÓN O: INTERRUPCIÓN VOLUNTARIA DEL EMBARAZO, (IVE)"]
["TIPO DE INTERVENCIÓN",null,"TOTAL","BENEFICIARIOS MAI","GRUPOS ETAREOS",null,"CAUSALES",null,null,"COMPRAS REALIZADAS AL SISTEMA ","COMPRAS REALIZADAS AL SISTEMA","COMPRAS REALIZADAS AL EXTRA-SISTEMA","COMPRAS REALIZADAS AL EXTRA-SISTEMA"]
[null,null,null,null,"< 14 AÑOS","14 AÑOS Y MAS","CAUSAL N°1              MUJER EMBARAZADA CON RIESGO VITAL","CAUSAL N°2 INVIABILIDAD FETAL DE CARÁCTER LETAL","CAUSAL N°3 POR VIOLACIÓN","< 14 AÑOS","14 AÑOS Y MAS","< 14 AÑOS","14 AÑOS Y MAS"]
["Día cama hospitalización integral medicina, cirugía, pediatría, obstetricia-ginecología y especialidades (sala 3 camas o más) (Hosp. Alta Complejidad)","Día cama hospitalización integral medicina, cirugía, pediatría, obstetricia-ginecología y especialidades (sala 3 camas o más) (Hosp. Alta Complejidad)",{"$f":"SUM(E500:F500)","v":0}]
["Día cama hospitalización integral medicina, cirugía, pediatría, obstetricia-ginecología y especialidades (sala 3 camas o más) (Hosp. Mediana Complejidad)","Día cama hospitalización integral medicina, cirugía, pediatría, obstetricia-ginecología y especialidades (sala 3 camas o más) (Hosp. Mediana Complejidad)",{"$f":"SUM(E501:F501)","v":0}]
["Día cama hospitalización integral adulto en Unidad de Cuidado Intensivo (U.C.I.) ",null,{"$f":"SUM(E502:F502)","v":0}]
["Día cama hospitalización integral adulto en Unidad de Tratamiento Intermedio (U.T.I)",null,{"$f":"SUM(E503:F503)","v":0}]
["Día cama integral de observación o día cama integral ambulatorio diurno",null,{"$f":"SUM(E504:F504)","v":0}]
[null,"TOTAL DIAS CAMAS",{"$f":"SUM(C500:C504)","v":0},0,0,0,0,0,0,{"$f":"SUM(J500:J504)","v":0},{"$f":"SUM(K500:K504)","v":0},{"$f":"SUM(L500:L504)","v":0},{"$f":"SUM(M500:M504)","v":0}]
["Cariograma en fibroblastos por cultivo de trofoblasto, líquido amniótico, piel u otros bandeos G y eventualmente Q,R,C,NOR",null,{"$f":"SUM(E506:F506)","v":0}]
["FISH Cromosomas X e Y",null,{"$f":"SUM(E507:F507)","v":0}]
["Cromosoma 22",null,{"$f":"SUM(E508:F508)","v":0}]
["Diagnóstico Genético Molecular: Displasia Tanatofórica tipo I y II",null,{"$f":"SUM(E509:F509)","v":0}]
["TOTAL EXAMENES DE LABORATORIO",null,{"$f":"SUM(C506:C509)","v":0},0,0,0,0,0,0,{"$f":"SUM(J506:J509)","v":0},{"$f":"SUM(K506:K509)","v":0},{"$f":"SUM(L506:L509)","v":0},{"$f":"SUM(M506:M509)","v":0}]
["Radiografía de tórax frontal y lateral",null,{"$f":"SUM(E511:F511)","v":0}]
["Radiografía de pelvis, cadera o coxofemoral",null,{"$f":"SUM(E512:F512)","v":0}]
["Radiografía de brazo, antebrazo, codo, muñeca, mano, dedos, pie  (frontal y lateral)",null,{"$f":"SUM(E513:F513)","v":0}]
[null,"TOTAL EXAMENES RADIOLÓGICOS",{"$f":"SUM(C511:C513)","v":0},0,0,0,0,0,0,{"$f":"SUM(J511:J513)","v":0},{"$f":"SUM(K511:K513)","v":0},{"$f":"SUM(L511:L513)","v":0},{"$f":"SUM(M511:M513)","v":0}]
["Resonancia Magnética Fetal",null,{"$f":"SUM(E515:F515)","v":0}]
["Ecografía obstétrica",null,{"$f":"SUM(E516:F516)","v":0}]
["Ecografía doppler de vasos placentarios",null,{"$f":"SUM(E517:F517)","v":0}]
[null,"TOTAL EXAMENES POR IMÁGENES",{"$f":"SUM(C515:C517)","v":0},{"$f":"SUM(D515:D517)","v":0},0,0,{"$f":"SUM(G515:G517)","v":0},{"$f":"SUM(H515:H517)","v":0},{"$f":"SUM(I515:I517)","v":0},{"$f":"SUM(J515:J517)","v":0},0,0,0]
["Consulta Médica de Especialidad en Obstetricia y Ginecología ","Consulta Médica de Especialidad en Obstetricia y Ginecología",{"$f":"SUM(E519:F519)","v":0}]
["Evaluación psiquiátrica previa a terapia (1ra. consulta).","Evaluación psiquiátrica previa a terapia (1ra. consulta).",0]
["Consulta Psicólogo clínico (sesiones 45')","Consulta Psicólogo clínico (sesiones 45')",0]
["Consulta o control por enfermera, matrona o nutricionista",null,0]
["Educación de grupo por asistente social","Educación de grupo por asistente social",0]
["Atención psiquiátrica o psicoterapia de familia, individual, de relajación o de manejo (con familia u otros);(cada sesión mínimo 45')","Atención psiquiátrica o psicoterapia de familia, individual, de relajación o de manejo (con familia u otros);(cada sesión mínimo 45')",0]
["Psicoterapia de grupo (por psicólogo o psiquiatra) (4 a 8 pacientes)","Psicoterapia de grupo (por psicólogo o psiquiatra) (4 a 8 pacientes)",0]
[null,"TOTAL CONSULTAS ",{"$f":"SUM(C519:C525)","v":0},0,0,0,0,0,0,{"$f":"SUM(J519:J525)","v":0},{"$f":"SUM(K519:K525)","v":0},{"$f":"SUM(L519:L525)","v":0},{"$f":"SUM(M519:M525)","v":0}]
["Amniocentesis",null,{"$f":"SUM(E527:F527)","v":0}]
["Biopsia corial",null,0]
["Cordocentesis",null,0]
["Aspiración manual endouterina",null,0]
["Raspado uterino diagnóstico o terapéutico por metrorragia o por restos de aborto",null,0]
["Tratamiento Farmacológico Ley IVE (incluye Consulta especialidad en Obstetricia y Ginecología y Fármacos)",null,0]
[null,"TOTAL PROCEDIMIENTOS",{"$f":"SUM(C527:C531)","v":0},{"$f":"SUM(D527:D532)","v":0},0,0,0,0,0,{"$f":"SUM(J527:J532)","v":0},{"$f":"SUM(K527:K532)","v":0},{"$f":"SUM(L527:L532)","v":0},{"$f":"SUM(M527:M532)","v":0}]
["Parto normal","Parto normal",{"$f":"SUM(E534:F534)","v":0}]
["Parto distósico vaginal","Parto distósico vaginal",{"$f":"SUM(E535:F535)","v":0}]
["Parto presentación cefálica o podálica, c/s episiotomía, c/s sutura, c/s fórceps, c/s inducción, c/s versión interna, c/s revisión, c/s extracción manual de placenta, c/s monitorización. (Unico o Múltiple)",null,{"$f":"SUM(E536:F536)","v":0}]
["Cesárea c/s salpingoligadura o salpingectomía",null,{"$f":"SUM(E537:F537)","v":0}]
["Cesárea con histerectomía",null,0]
["Cesárea",null,{"$f":"SUM(E539:F539)","v":0}]
[null,"TOTAL CIRUGÍAS OBSTETRICAS Y PARTOS",{"$f":"SUM(C534:C539)","v":0},{"$f":"SUM(D534:D539)","v":0},0,0,0,0,0,{"$f":"SUM(J534:J539)","v":0},{"$f":"SUM(K534:K539)","v":0},{"$f":"SUM(L534:L539)","v":0},{"$f":"SUM(M534:M539)","v":0}]
[null,"TOTAL",{"$f":"SUM(C505+C510+C514+C518+C526+C533+C540)","v":0},{"$f":"SUM(D505+D510+D514+D518+D526+D533)","v":0},0,0,0,0,0,{"$f":"SUM(J505+J510+J514+J518+J526+J533)","v":0},{"$f":"SUM(K505+K510+K514+K518+K526+K533)","v":0},0,0]

{"sheet":"Control","index":3,"n_rows":82,"n_cols":4,"rows_kept":82,"cut":false,"hidden":false,"merged":[]}
[]
[null,"HOJA","SECCION","Nº Errores"]
[null,"NOMBRE","Código comuna",{"$f":"+NOMBRE!AF2","v":1}]
[null,"NOMBRE","Código establecimiento/estrategia",{"$f":"+NOMBRE!AF3","v":1}]
[null,"NOMBRE","Tipo establecimiento/estrategia",{"$f":"+NOMBRE!AF4","v":1}]
[null,"NOMBRE","Dependencia",{"$f":"+NOMBRE!AF5","v":1}]
[null,"NOMBRE","Código Mes",{"$f":"+NOMBRE!AF6","v":1}]
[null,"B17","SECCIÓN E: INTERVENCIONES QUIRÚRGICAS POR TIPO DE INTERVENCIÓN ",{"$f":"SUM('B17'!AB413:AB416)","v":0}]
[null,"B17","SECCIÓN L: OTRAS ATENCIONES A PACIENTES AMBULATORIOS",{"$f":"SUM('B17'!AB474:AB476)","v":0}]
[null,"B17","SECCIÓN N: OTROS TRASLADOS DE PACIENTES",{"$f":"SUM('B17'!AB479:AB481)","v":0}]
[null,null,"TOTAL ERRORES",{"$f":"SUM(D3:D10)","v":5}]
[]
[]
[]
[null,"¿Nombre vacío?"]
[null,{"$f":"ISBLANK(NOMBRE!B2)","v":true}]
[]
[]
[]
[]
[]
[]
[]
[]
[]
[]
[]
[]
[]
[]
[]
[]
[]
[]
[]
[]
[]
[]
[]
[]
[]
[]
[]
[]
[]
[]
[]
[]
[]
[]
[]
[]
[]
[]
[]
[]
[]
[]
[]
[]
[]
[]
[]
[]
[]
[]
[]
[]
[]
[]
[]
[]
[]
[]
[]
[]
[]
[]
[]
[]
[]
[null,null,null,{"$f":"SUM(D3:D7)","v":5}]

{"sheet":"MACROS","index":4,"n_rows":7,"n_cols":2,"rows_kept":7,"cut":false,"hidden":false,"merged":[[0,0,0,13],[6,1,7,7]]}
["Hoja de Macros y Utilidades"]
[{"$f":"CONCATENATE(\"ESTABLECIMIENTO/ESTRATEGIA: \",NOMBRE!B3,\" - \",\"( \",NOMBRE!C3,NOMBRE!D3,NOMBRE!E3,NOMBRE!F3,NOMBRE!G3,NOMBRE!H3,NOMBRE!I3,\" )\")","v":"ESTABLECIMIENTO/ESTRATEGIA:  - ( Falta Cód. Est. )"}]
[]
[]
[null,"CREA UNA COPIA  DEL ARCHIVO  (TRANFORMA HOJAS A VALORES)\nA ESTE NUEVO ARCHIVO DEBERÁ ASIGNARLE UN NOMBRE"]
[null,"Contraseña para copia del archivo :DEIS"]
[null,{"$f":"IF(Control!D11>0,\"REVISE LA HOJA CONTROL, EXISTEN ERRORES\",\"\")","v":"REVISE LA HOJA CONTROL, EXISTEN ERRORES"}]